BDBM50306551 1-(beta-D-Glucopyranosyl)-4-(1-naphthyl)-1,2,3-triazole::1-beta-D-glucopyranosyl-4-naphthalen-1-yl-1H-1,2,3-triazole::CHEMBL600202
SMILES: OC[C@H]1O[C@H]([C@H](O)[C@@H](O)[C@@H]1O)n1cc(nn1)-c1cccc2ccccc12
InChI Key: InChIKey=ZQSWMZLNZOWSSB-UYTYNIKBSA-N
Data: 2 KI  1 IC50
PDB links: 1 PDB ID matches this monomer.
Activity Spreadsheet -- Enzyme Inhibition Constant Data from BindingDB
Found 3 hits for monomerid = 50306551
Trg + Lig
Ki
nM
ΔG°
kcal/mole
IC50
nM
Kd
nM
EC50/IC50
nM
koff
s-1
kon
M-1s-1
pHTemp
°C
Glycogen phosphorylase, muscle form
(Oryctolagus cuniculus (rabbit))
BDBM50306551
(1-(beta-D-Glucopyranosyl)-4-(1-naphthyl)-1,2,3-tri...)
Show SMILES OC[C@H]1O[C@H]([C@H](O)[C@@H](O)[C@@H]1O)n1cc(nn1)-c1cccc2ccccc12 |r|
Show InChI InChI=1S/C18H19N3O5/c22-9-14-15(23)16(24)17(25)18(26-14)21-8-13(19-20-21)12-7-3-5-10-4-1-2-6-11(10)12/h1-8,14-18,22-25H,9H2/t14-,15-,16+,17-,18-/m1/s1
1.36E+5n/an/an/an/an/an/an/an/a
University of Debrecen
Curated by ChEMBL
Assay Description
Inhibition of rabbit skeletal muscle glycogen phosphorylase b by Dixon plot
Bioorg Med Chem 18: 1171-80 (2010)
Article DOI: 10.1016/j.bmc.2009.12.043
BindingDB Entry DOI: 10.7270/Q2JQ114D
3D
3D Structure (crystal)
Glycogen phosphorylase, muscle form
(Oryctolagus cuniculus (rabbit))
BDBM50306551
(1-(beta-D-Glucopyranosyl)-4-(1-naphthyl)-1,2,3-tri...)
Show SMILES OC[C@H]1O[C@H]([C@H](O)[C@@H](O)[C@@H]1O)n1cc(nn1)-c1cccc2ccccc12 |r|
Show InChI InChI=1S/C18H19N3O5/c22-9-14-15(23)16(24)17(25)18(26-14)21-8-13(19-20-21)12-7-3-5-10-4-1-2-6-11(10)12/h1-8,14-18,22-25H,9H2/t14-,15-,16+,17-,18-/m1/s1
1.36E+5n/an/an/an/an/an/an/an/a
University of Debrecen
Curated by ChEMBL
Assay Description
Inhibition of rabbit skeletal muscle glycogen phosphorylase b
Bioorg Med Chem 18: 1171-80 (2010)
Article DOI: 10.1016/j.bmc.2009.12.043
BindingDB Entry DOI: 10.7270/Q2JQ114D
3D
3D Structure (crystal)
Glycogen phosphorylase, muscle form
(Oryctolagus cuniculus (rabbit))
BDBM50306551
(1-(beta-D-Glucopyranosyl)-4-(1-naphthyl)-1,2,3-tri...)
Show SMILES OC[C@H]1O[C@H]([C@H](O)[C@@H](O)[C@@H]1O)n1cc(nn1)-c1cccc2ccccc12 |r|
Show InChI InChI=1S/C18H19N3O5/c22-9-14-15(23)16(24)17(25)18(26-14)21-8-13(19-20-21)12-7-3-5-10-4-1-2-6-11(10)12/h1-8,14-18,22-25H,9H2/t14-,15-,16+,17-,18-/m1/s1
n/an/a 6.25E+5n/an/an/an/an/an/a
University of Debrecen
Curated by ChEMBL
Assay Description
Inhibition of rabbit skeletal muscle glycogen phosphorylase b by Lineweaver-Burk plot analysis
Bioorg Med Chem 18: 1171-80 (2010)
Article DOI: 10.1016/j.bmc.2009.12.043
BindingDB Entry DOI: 10.7270/Q2JQ114D
3D
3D Structure (crystal)