null
SMILES: Cn1nc(C(N)=O)c2CCc3cnc(NC4CCN(CC4)C(=O)C4CCN(CC4)S(=O)(=O)c4ccccc4)nc3-c12
InChI Key: InChIKey=KMVQBPWEFOSEIR-UHFFFAOYSA-N
Activity Spreadsheet -- Enzyme Inhibition Constant Data from BindingDB
Found 2 hits for monomerid = 50307545
Trg + Lig
Ki
nM
ΔG°
kcal/mole
IC50
nM
Kd
nM
EC50/IC50
nM
koff
s-1
kon
M-1s-1
pHTemp
°C
Aurora kinase A
(Homo sapiens (Human))
BDBM50307545
(1-Methyl-8-{[1-(phenylsulfonyl)piperidin-4-yl]amin...)
Show SMILES Cn1nc(C(N)=O)c2CCc3cnc(NC4CCN(CC4)C(=O)C4CCN(CC4)S(=O)(=O)c4ccccc4)nc3-c12
Show InChI InChI=1S/C28H34N8O4S/c1-34-25-22(24(33-34)26(29)37)8-7-19-17-30-28(32-23(19)25)31-20-11-13-35(14-12-20)27(38)18-9-15-36(16-10-18)41(39,40)21-5-3-2-4-6-21/h2-6,17-18,20H,7-16H2,1H3,(H2,29,37)(H,30,31,32)
NCI pathway
Reactome pathway
n/an/a 1.29E+3n/an/an/an/an/an/a
Nerviano Medical Sciences Srl
Curated by ChEMBL
Assay Description
Inhibition of Aurora A
J Med Chem 53: 2171-87 (2010)
Article DOI: 10.1021/jm901710h
BindingDB Entry DOI: 10.7270/Q2N879W9
Cyclin-A1/Cyclin-A2/Cyclin-dependent kinase 2
(Homo sapiens (Human))
BDBM50307545
(1-Methyl-8-{[1-(phenylsulfonyl)piperidin-4-yl]amin...)
Show SMILES Cn1nc(C(N)=O)c2CCc3cnc(NC4CCN(CC4)C(=O)C4CCN(CC4)S(=O)(=O)c4ccccc4)nc3-c12
Show InChI InChI=1S/C28H34N8O4S/c1-34-25-22(24(33-34)26(29)37)8-7-19-17-30-28(32-23(19)25)31-20-11-13-35(14-12-20)27(38)18-9-15-36(16-10-18)41(39,40)21-5-3-2-4-6-21/h2-6,17-18,20H,7-16H2,1H3,(H2,29,37)(H,30,31,32)
Reactome pathway
n/an/a 4n/an/an/an/an/an/a
Nerviano Medical Sciences Srl
Curated by ChEMBL
Assay Description
Inhibition of CDK2/Cyclin A
J Med Chem 53: 2171-87 (2010)
Article DOI: 10.1021/jm901710h
BindingDB Entry DOI: 10.7270/Q2N879W9