BDBM50309972 4-((1H-1,2,4-Triazol-1-yl)methyl)-5-(4-chlorophenyl)-1-(2,4-dichlorophenyl)-N-(2,6-dimethylpiperidin-1-yl)-1H-pyrazole-3-carboxamide::CHEMBL603965
SMILES: CC1CCCC(C)N1NC(=O)c1nn(c(c1Cn1cncn1)-c1ccc(Cl)cc1)-c1ccc(Cl)cc1Cl
InChI Key: InChIKey=FCULAZHPQKEBOV-UHFFFAOYSA-N
Data: 1 IC50
Activity Spreadsheet -- Enzyme Inhibition Constant Data from BindingDB
Found 1 hit for monomerid = 50309972
Trg + Lig
Ki
nM
ΔG°
kcal/mole
IC50
nM
Kd
nM
EC50/IC50
nM
koff
s-1
kon
M-1s-1
pHTemp
°C
Cannabinoid receptor 1
(Rattus norvegicus (rat))
BDBM50309972
(4-((1H-1,2,4-Triazol-1-yl)methyl)-5-(4-chloropheny...)
Show SMILES CC1CCCC(C)N1NC(=O)c1nn(c(c1Cn1cncn1)-c1ccc(Cl)cc1)-c1ccc(Cl)cc1Cl
Show InChI InChI=1S/C26H26Cl3N7O/c1-16-4-3-5-17(2)35(16)33-26(37)24-21(13-34-15-30-14-31-34)25(18-6-8-19(27)9-7-18)36(32-24)23-11-10-20(28)12-22(23)29/h6-12,14-17H,3-5,13H2,1-2H3,(H,33,37)
Reactome pathway
n/an/a 11.4n/an/an/an/an/an/a
Green Cross Corporation
Curated by ChEMBL
Assay Description
Displacement of [3H]CP55,940 from CB1 receptor in Sprague-Dawley rat cerebellar membrane
Bioorg Med Chem 18: 1149-62 (2010)
Article DOI: 10.1016/j.bmc.2009.12.040
BindingDB Entry DOI: 10.7270/Q2TD9XG2