BDBM50310069 4-((1H-1,2,4-Triazol-1-yl)methyl)-5-(4-chlorophenyl)-1-(2,4-dichlorophenyl)-N-(3,3-dimethylbutan-2-yl)-1H-pyrazole-3-carboxamide::CHEMBL598774
SMILES: CC(NC(=O)c1nn(c(c1Cn1cncn1)-c1ccc(Cl)cc1)-c1ccc(Cl)cc1Cl)C(C)(C)C
InChI Key: InChIKey=HPKSVNYSDSMUOB-UHFFFAOYSA-N
Data: 1 IC50
Activity Spreadsheet -- Enzyme Inhibition Constant Data from BindingDB
Found 1 hit for monomerid = 50310069
Trg + Lig
Ki
nM
ΔG°
kcal/mole
IC50
nM
Kd
nM
EC50/IC50
nM
koff
s-1
kon
M-1s-1
pHTemp
°C
Cannabinoid receptor 1
(Rattus norvegicus (rat))
BDBM50310069
(4-((1H-1,2,4-Triazol-1-yl)methyl)-5-(4-chloropheny...)
Show SMILES CC(NC(=O)c1nn(c(c1Cn1cncn1)-c1ccc(Cl)cc1)-c1ccc(Cl)cc1Cl)C(C)(C)C
Show InChI InChI=1S/C25H25Cl3N6O/c1-15(25(2,3)4)31-24(35)22-19(12-33-14-29-13-30-33)23(16-5-7-17(26)8-6-16)34(32-22)21-10-9-18(27)11-20(21)28/h5-11,13-15H,12H2,1-4H3,(H,31,35)
Reactome pathway
n/an/a 8.44n/an/an/an/an/an/a
Green Cross Corporation
Curated by ChEMBL
Assay Description
Displacement of [3H]CP55,940 from CB1 receptor in Sprague-Dawley rat cerebellar membrane
Bioorg Med Chem 18: 1149-62 (2010)
Article DOI: 10.1016/j.bmc.2009.12.040
BindingDB Entry DOI: 10.7270/Q2TD9XG2