null
SMILES: Fc1ccc(cc1)-c1ccc(cn1)S(=O)(=O)Cc1ccc2CCNCCc2c1
InChI Key: InChIKey=MSCYJFQRYSADGM-UHFFFAOYSA-N
Activity Spreadsheet -- Enzyme Inhibition Constant Data from BindingDB
Found 3 hits for monomerid = 50311423
Trg + Lig
Ki
nM
ΔG°
kcal/mole
IC50
nM
Kd
nM
EC50/IC50
nM
koff
s-1
kon
M-1s-1
pHTemp
°C
Cytochrome P450 2D6
(Homo sapiens (Human))
BDBM50311423
(7-((6-(4-fluorophenyl)pyridin-3-ylsulfonyl)methyl)...)
Show SMILES Fc1ccc(cc1)-c1ccc(cn1)S(=O)(=O)Cc1ccc2CCNCCc2c1
Show InChI InChI=1S/C22H21FN2O2S/c23-20-5-3-18(4-6-20)22-8-7-21(14-25-22)28(26,27)15-16-1-2-17-9-11-24-12-10-19(17)13-16/h1-8,13-14,24H,9-12,15H2
n/an/a 600n/an/an/an/an/an/a
GlaxoSmithKline
Curated by ChEMBL
Assay Description
Inhibition of human recombinant CYP2D6
Bioorg Med Chem Lett 19: 6452-8 (2009)
Article DOI: 10.1016/j.bmcl.2009.09.027
BindingDB Entry DOI: 10.7270/Q2DV1K0C
Motilin receptor
(Homo sapiens (Human))
BDBM50311423
(7-((6-(4-fluorophenyl)pyridin-3-ylsulfonyl)methyl)...)
Show SMILES Fc1ccc(cc1)-c1ccc(cn1)S(=O)(=O)Cc1ccc2CCNCCc2c1
Show InChI InChI=1S/C22H21FN2O2S/c23-20-5-3-18(4-6-20)22-8-7-21(14-25-22)28(26,27)15-16-1-2-17-9-11-24-12-10-19(17)13-16/h1-8,13-14,24H,9-12,15H2
Reactome pathway
n/an/an/an/a 5.01n/an/an/an/a
GlaxoSmithKline
Curated by ChEMBL
Assay Description
Agonist activity at human recombinant motilin receptor expressed in CHO cells by FLIPR assay
Bioorg Med Chem Lett 19: 6452-8 (2009)
Article DOI: 10.1016/j.bmcl.2009.09.027
BindingDB Entry DOI: 10.7270/Q2DV1K0C
Growth hormone secretagogue receptor type 1
(Homo sapiens (Human))
BDBM50311423
(7-((6-(4-fluorophenyl)pyridin-3-ylsulfonyl)methyl)...)
Show SMILES Fc1ccc(cc1)-c1ccc(cn1)S(=O)(=O)Cc1ccc2CCNCCc2c1
Show InChI InChI=1S/C22H21FN2O2S/c23-20-5-3-18(4-6-20)22-8-7-21(14-25-22)28(26,27)15-16-1-2-17-9-11-24-12-10-19(17)13-16/h1-8,13-14,24H,9-12,15H2
Reactome pathway
n/an/an/an/a>1.00E+3n/an/an/an/a
GlaxoSmithKline
Curated by ChEMBL
Assay Description
Agonist activity at human gherlin receptor
Bioorg Med Chem Lett 19: 6452-8 (2009)
Article DOI: 10.1016/j.bmcl.2009.09.027
BindingDB Entry DOI: 10.7270/Q2DV1K0C