BDBM50313005 3-(1,2-dimethyl-1H-indol-3-yl)-4-(3-methoxyphenyl)-1H-pyrrole-2,5-dione::CHEMBL1080933
SMILES: COc1cccc(c1)C1=C(C(=O)NC1=O)c1c(C)n(C)c2ccccc12
InChI Key: InChIKey=XRPAAPKYUKNKSM-UHFFFAOYSA-N
Data: 1 IC50
Activity Spreadsheet -- Enzyme Inhibition Constant Data from BindingDB
Found 1 hit for monomerid = 50313005
Trg + Lig
Ki
nM
ΔG°
kcal/mole
IC50
nM
Kd
nM
EC50/IC50
nM
koff
s-1
kon
M-1s-1
pHTemp
°C
Glycogen synthase kinase-3 beta
(Homo sapiens (Human))
BDBM50313005
(3-(1,2-dimethyl-1H-indol-3-yl)-4-(3-methoxyphenyl)...)
Show SMILES COc1cccc(c1)C1=C(C(=O)NC1=O)c1c(C)n(C)c2ccccc12 |t:9|
Show InChI InChI=1S/C21H18N2O3/c1-12-17(15-9-4-5-10-16(15)23(12)2)19-18(20(24)22-21(19)25)13-7-6-8-14(11-13)26-3/h4-11H,1-3H3,(H,22,24,25)
NCI pathway
Reactome pathway
n/an/a 220n/an/an/an/an/an/a
Roche Palo Alto
Curated by ChEMBL
Assay Description
Inhibition of human recombinant GSK3-beta assessed as [gamma33]ATP transfer to biotinylated CREB-peptide substrate after 1 hr by scintillation counti...
Bioorg Med Chem Lett 20: 1693-6 (2010)
Article DOI: 10.1016/j.bmcl.2010.01.038
BindingDB Entry DOI: 10.7270/Q2ZK5HNS