BDBM50313613 5'-Chloro-1H,1'H-[2,3']biindolylidene-3,2'-dione::CHEMBL1084939
SMILES: Clc1ccc2NC(=O)\C(=C3/Nc4ccccc4C3=O)c2c1
InChI Key: InChIKey=ANUNRTRKLZJBSN-YPKPFQOOSA-N
Data: 2 IC50
Activity Spreadsheet -- Enzyme Inhibition Constant Data from BindingDB
Found 2 hits for monomerid = 50313613
Trg + Lig
Ki
nM
ΔG°
kcal/mole
IC50
nM
Kd
nM
EC50/IC50
nM
koff
s-1
kon
M-1s-1
pHTemp
°C
Receptor-type tyrosine-protein kinase FLT3
(Homo sapiens (Human))
BDBM50313613
(5'-Chloro-1H,1'H-[2,3']biindolylidene-3,2'-dione |...)
Show SMILES Clc1ccc2NC(=O)\C(=C3/Nc4ccccc4C3=O)c2c1
Show InChI InChI=1S/C16H9ClN2O2/c17-8-5-6-12-10(7-8)13(16(21)19-12)14-15(20)9-3-1-2-4-11(9)18-14/h1-7,18H,(H,19,21)/b14-13-
n/an/a 212n/an/an/an/an/an/a
Institute of Science and Technology
Curated by ChEMBL
Assay Description
Inhibition of FLT3 by HTRF assay
Bioorg Med Chem Lett 20: 2033-7 (2010)
Article DOI: 10.1016/j.bmcl.2010.01.039
BindingDB Entry DOI: 10.7270/Q29W0GF0
Serine/threonine-protein kinase 17B
(Homo sapiens (Human))
BDBM50313613
(5'-Chloro-1H,1'H-[2,3']biindolylidene-3,2'-dione |...)
Show SMILES Clc1ccc2NC(=O)\C(=C3/Nc4ccccc4C3=O)c2c1
Show InChI InChI=1S/C16H9ClN2O2/c17-8-5-6-12-10(7-8)13(16(21)19-12)14-15(20)9-3-1-2-4-11(9)18-14/h1-7,18H,(H,19,21)/b14-13-
n/an/a>1.00E+4n/an/an/an/an/an/a
Korea Research Institute of Chemical Technology
Curated by ChEMBL
Assay Description
Inhibition of DRAK2 (unknown origin) using MRLC3 peptide as substrate incubated for 2 hrs by ADP-Glo kinase assay
Bioorg Med Chem Lett 26: 2719-23 (2016)
Article DOI: 10.1016/j.bmcl.2016.03.111
BindingDB Entry DOI: 10.7270/Q2N29ZTZ