BDBM50313798 (2R,4S,5S)-5-((S)-2-((S)-2-acetamido-4-methylpentanamido)-4-(methylthio)butanamido)-N-butyl-4-hydroxy-2,7-dimethyloctanamide::CHEMBL1097361::N-acetyl-L-leucyl-N-[(4S,5S,7R)-8-(butylamino)-5-hydroxy-2,7-dimethyl-8-oxooctan-4-yl]-L-methioninamide
SMILES: CCCCNC(=O)[C@H](C)C[C@H](O)[C@H](CC(C)C)NC(=O)[C@H](CCSC)NC(=O)[C@H](CC(C)C)NC(C)=O
InChI Key: InChIKey=PEWRQHFGBBTOMS-FFYZIMEISA-N
Data: 2 IC50
PDB links: 1 PDB ID matches this monomer.
Activity Spreadsheet -- Enzyme Inhibition Constant Data from BindingDB
Found 2 hits for monomerid = 50313798
Trg + Lig
Ki
nM
ΔG°
kcal/mole
IC50
nM
Kd
nM
EC50/IC50
nM
koff
s-1
kon
M-1s-1
pHTemp
°C
Cathepsin D
(Homo sapiens (Human))
BDBM50313798
((2R,4S,5S)-5-((S)-2-((S)-2-acetamido-4-methylpenta...)
Show SMILES CCCCNC(=O)[C@H](C)C[C@H](O)[C@H](CC(C)C)NC(=O)[C@H](CCSC)NC(=O)[C@H](CC(C)C)NC(C)=O |r|
Show InChI InChI=1S/C27H52N4O5S/c1-9-10-12-28-25(34)19(6)16-24(33)22(14-17(2)3)31-26(35)21(11-13-37-8)30-27(36)23(15-18(4)5)29-20(7)32/h17-19,21-24,33H,9-16H2,1-8H3,(H,28,34)(H,29,32)(H,30,36)(H,31,35)/t19-,21+,22+,23+,24+/m1/s1
NCI pathway
Reactome pathway
n/an/a 9n/an/an/an/an/an/a
Universit£ de Montr£al
Curated by ChEMBL
Assay Description
Inhibition of Cathepsin D
Bioorg Med Chem Lett 20: 1924-7 (2010)
Article DOI: 10.1016/j.bmcl.2010.01.139
BindingDB Entry DOI: 10.7270/Q2TD9XHH
Beta-secretase 1
(Homo sapiens (Human))
BDBM50313798
((2R,4S,5S)-5-((S)-2-((S)-2-acetamido-4-methylpenta...)
Show SMILES CCCCNC(=O)[C@H](C)C[C@H](O)[C@H](CC(C)C)NC(=O)[C@H](CCSC)NC(=O)[C@H](CC(C)C)NC(C)=O |r|
Show InChI InChI=1S/C27H52N4O5S/c1-9-10-12-28-25(34)19(6)16-24(33)22(14-17(2)3)31-26(35)21(11-13-37-8)30-27(36)23(15-18(4)5)29-20(7)32/h17-19,21-24,33H,9-16H2,1-8H3,(H,28,34)(H,29,32)(H,30,36)(H,31,35)/t19-,21+,22+,23+,24+/m1/s1
n/an/a 53n/an/an/an/an/an/a
Universit£ de Montr£al
Curated by ChEMBL
Assay Description
Inhibition of BACE1
Bioorg Med Chem Lett 20: 1924-7 (2010)
Article DOI: 10.1016/j.bmcl.2010.01.139
BindingDB Entry DOI: 10.7270/Q2TD9XHH
3D
3D Structure (crystal)