BDBM50314606 (5S)-2-amino-5-(2',5'-difluorobiphenyl-3-yl)-3-methyl-5-pyridin-4-yl-3,5-dihydro-4H-imidazol-4-one::(S)-2-amino-4-(2',5'-difluorobiphenyl-3-yl)-1-methyl-4-(pyridin-4-yl)-1H-imidazol-5(4H)-one::CHEMBL1092788
SMILES: CN1C(N)=N[C@](C1=O)(c1ccncc1)c1cccc(c1)-c1cc(F)ccc1F
InChI Key: InChIKey=RKYFABJLGJZOBA-OAQYLSRUSA-N
Data: 3 IC50
PDB links: 1 PDB ID matches this monomer.
Activity Spreadsheet -- Enzyme Inhibition Constant Data from BindingDB
Found 3 hits for monomerid = 50314606
Trg + Lig
Ki
nM
ΔG°
kcal/mole
IC50
nM
Kd
nM
EC50/IC50
nM
koff
s-1
kon
M-1s-1
pHTemp
°C
Beta-secretase 1
(Homo sapiens (Human))
BDBM50314606
((5S)-2-amino-5-(2',5'-difluorobiphenyl-3-yl)-3-met...)
Show SMILES CN1C(N)=N[C@](C1=O)(c1ccncc1)c1cccc(c1)-c1cc(F)ccc1F |r,c:3|
Show InChI InChI=1S/C21H16F2N4O/c1-27-19(28)21(26-20(27)24,14-7-9-25-10-8-14)15-4-2-3-13(11-15)17-12-16(22)5-6-18(17)23/h2-12H,1H3,(H2,24,26)/t21-/m1/s1
n/an/a 20n/an/an/an/an/an/a
Wyeth Research
Curated by ChEMBL
Assay Description
Inhibition of BACE1 by FRET assay
Bioorg Med Chem Lett 20: 2326-9 (2010)
Article DOI: 10.1016/j.bmcl.2010.01.136
BindingDB Entry DOI: 10.7270/Q28C9WDF
3D
3D Structure (crystal)
Cathepsin D
(Homo sapiens (Human))
BDBM50314606
((5S)-2-amino-5-(2',5'-difluorobiphenyl-3-yl)-3-met...)
Show SMILES CN1C(N)=N[C@](C1=O)(c1ccncc1)c1cccc(c1)-c1cc(F)ccc1F |r,c:3|
Show InChI InChI=1S/C21H16F2N4O/c1-27-19(28)21(26-20(27)24,14-7-9-25-10-8-14)15-4-2-3-13(11-15)17-12-16(22)5-6-18(17)23/h2-12H,1H3,(H2,24,26)/t21-/m1/s1
NCI pathway
Reactome pathway
n/an/a 5.50E+3n/an/an/an/an/an/a
Wyeth Research
Curated by ChEMBL
Assay Description
Inhibition of cathepsin D by FRET assay
Bioorg Med Chem Lett 20: 2326-9 (2010)
Article DOI: 10.1016/j.bmcl.2010.01.136
BindingDB Entry DOI: 10.7270/Q28C9WDF
Beta-secretase 2
(Homo sapiens (Human))
BDBM50314606
((5S)-2-amino-5-(2',5'-difluorobiphenyl-3-yl)-3-met...)
Show SMILES CN1C(N)=N[C@](C1=O)(c1ccncc1)c1cccc(c1)-c1cc(F)ccc1F |r,c:3|
Show InChI InChI=1S/C21H16F2N4O/c1-27-19(28)21(26-20(27)24,14-7-9-25-10-8-14)15-4-2-3-13(11-15)17-12-16(22)5-6-18(17)23/h2-12H,1H3,(H2,24,26)/t21-/m1/s1
n/an/a 100n/an/an/an/an/an/a
Wyeth Research
Curated by ChEMBL
Assay Description
Inhibition of BACE2 by FRET assay
Bioorg Med Chem Lett 20: 2326-9 (2010)
Article DOI: 10.1016/j.bmcl.2010.01.136
BindingDB Entry DOI: 10.7270/Q28C9WDF