BDBM50315560 (S)-2-amino-3-(4-(2-(biphenyl-4-yl)ethoxy)-2-(trifluoromethyl)phenylamino)-2-methyl-3-oxopropyl dihydrogen phosphate::CHEMBL1090828
SMILES: C[C@](N)(COP(O)(O)=O)C(=O)Nc1ccc(OCCc2ccc(cc2)-c2ccccc2)cc1C(F)(F)F
InChI Key: InChIKey=YMBOZHBXRGFOHL-DEOSSOPVSA-N
Data: 2 IC50
Activity Spreadsheet -- Enzyme Inhibition Constant Data from BindingDB
Found 2 hits for monomerid = 50315560
Trg + Lig
Ki
nM
ΔG°
kcal/mole
IC50
nM
Kd
nM
EC50/IC50
nM
koff
s-1
kon
M-1s-1
pHTemp
°C
Sphingosine 1-phosphate receptor 3
(Homo sapiens (Human))
BDBM50315560
((S)-2-amino-3-(4-(2-(biphenyl-4-yl)ethoxy)-2-(trif...)
Show SMILES C[C@](N)(COP(O)(O)=O)C(=O)Nc1ccc(OCCc2ccc(cc2)-c2ccccc2)cc1C(F)(F)F |r|
Show InChI InChI=1S/C25H26F3N2O6P/c1-24(29,16-36-37(32,33)34)23(31)30-22-12-11-20(15-21(22)25(26,27)28)35-14-13-17-7-9-19(10-8-17)18-5-3-2-4-6-18/h2-12,15H,13-14,16,29H2,1H3,(H,30,31)(H2,32,33,34)/t24-/m0/s1
NCI pathway
Reactome pathway
n/an/a 700n/an/an/an/an/an/a
Praecis Pharmaceuticals Inc
Curated by ChEMBL
Assay Description
Displacement of [33P]sphingosine-1-phosphate from human S1P3 receptor expressed in HEK293T cells after 60 mins by scintillation counting
Bioorg Med Chem Lett 20: 2520-4 (2010)
Article DOI: 10.1016/j.bmcl.2010.02.098
BindingDB Entry DOI: 10.7270/Q2XS5VJB
Sphingosine 1-phosphate receptor 1
(Homo sapiens (Human))
BDBM50315560
((S)-2-amino-3-(4-(2-(biphenyl-4-yl)ethoxy)-2-(trif...)
Show SMILES C[C@](N)(COP(O)(O)=O)C(=O)Nc1ccc(OCCc2ccc(cc2)-c2ccccc2)cc1C(F)(F)F |r|
Show InChI InChI=1S/C25H26F3N2O6P/c1-24(29,16-36-37(32,33)34)23(31)30-22-12-11-20(15-21(22)25(26,27)28)35-14-13-17-7-9-19(10-8-17)18-5-3-2-4-6-18/h2-12,15H,13-14,16,29H2,1H3,(H,30,31)(H2,32,33,34)/t24-/m0/s1
Reactome pathway
n/an/a 6.40n/an/an/an/an/an/a
Praecis Pharmaceuticals Inc
Curated by ChEMBL
Assay Description
Displacement of [33P]sphingosine-1-phosphate from human S1P1 receptor expressed in HEK293T cells after 60 mins by scintillation counting
Bioorg Med Chem Lett 20: 2520-4 (2010)
Article DOI: 10.1016/j.bmcl.2010.02.098
BindingDB Entry DOI: 10.7270/Q2XS5VJB