null
SMILES: CCn1cc(c(n1)-c1ccc(NC(=O)Nc2ccccc2)cc1)-c1ccnc2[nH]c(cc12)-c1cc(CN(C)C)ccc1C
InChI Key: InChIKey=KJAGZTFLBMDQQT-UHFFFAOYSA-N
Activity Spreadsheet -- Enzyme Inhibition Constant Data from BindingDB
Found 2 hits for monomerid = 50316506
Trg + Lig
Ki
nM
ΔG°
kcal/mole
IC50
nM
Kd
nM
EC50/IC50
nM
koff
s-1
kon
M-1s-1
pHTemp
°C
Aurora kinase A
(Homo sapiens (Human))
BDBM50316506
(4-[3-(4-N-Phenylcarbamylaminophenyl)-1-ethyl-1H-py...)
Show SMILES CCn1cc(c(n1)-c1ccc(NC(=O)Nc2ccccc2)cc1)-c1ccnc2[nH]c(cc12)-c1cc(CN(C)C)ccc1C
Show InChI InChI=1S/C35H35N7O/c1-5-42-22-31(33(40-42)25-13-15-27(16-14-25)38-35(43)37-26-9-7-6-8-10-26)28-17-18-36-34-30(28)20-32(39-34)29-19-24(21-41(3)4)12-11-23(29)2/h6-20,22H,5,21H2,1-4H3,(H,36,39)(H2,37,38,43)
NCI pathway
Reactome pathway
n/an/a 113n/an/an/an/an/an/a
GlaxoSmithKline
Curated by ChEMBL
Assay Description
Inhibition of human Aurora A
J Med Chem 53: 3973-4001 (2010)
Article DOI: 10.1021/jm901870q
BindingDB Entry DOI: 10.7270/Q27082CK
Aurora kinase B
(Homo sapiens (Human))
BDBM50316506
(4-[3-(4-N-Phenylcarbamylaminophenyl)-1-ethyl-1H-py...)
Show SMILES CCn1cc(c(n1)-c1ccc(NC(=O)Nc2ccccc2)cc1)-c1ccnc2[nH]c(cc12)-c1cc(CN(C)C)ccc1C
Show InChI InChI=1S/C35H35N7O/c1-5-42-22-31(33(40-42)25-13-15-27(16-14-25)38-35(43)37-26-9-7-6-8-10-26)28-17-18-36-34-30(28)20-32(39-34)29-19-24(21-41(3)4)12-11-23(29)2/h6-20,22H,5,21H2,1-4H3,(H,36,39)(H2,37,38,43)
Reactome pathway
n/an/a 60n/an/an/an/an/an/a
GlaxoSmithKline
Curated by ChEMBL
Assay Description
Inhibition of human Aurora B by rapid dilution method
J Med Chem 53: 3973-4001 (2010)
Article DOI: 10.1021/jm901870q
BindingDB Entry DOI: 10.7270/Q27082CK