BDBM50316666 1-(2-ethoxyethyl)-3-ethyl-N5-methyl-N5-(1-methylpiperidin-4-yl)-N7-(4-methylpyridin-2-yl)-1H-pyrazolo[4,3-d]pyrimidine-5,7-diamine::CHEMBL1094191
SMILES: CCOCCn1nc(CC)c2nc(nc(Nc3cc(C)ccn3)c12)N(C)C1CCN(C)CC1
InChI Key: InChIKey=HRRIBNWFHPLPLR-UHFFFAOYSA-N
Data: 1 IC50
Activity Spreadsheet -- Enzyme Inhibition Constant Data from BindingDB
Found 1 hit for monomerid = 50316666
Trg + Lig
Ki
nM
ΔG°
kcal/mole
IC50
nM
Kd
nM
EC50/IC50
nM
koff
s-1
kon
M-1s-1
pHTemp
°C
cGMP-specific 3',5'-cyclic phosphodiesterase
(Homo sapiens (Human))
BDBM50316666
(1-(2-ethoxyethyl)-3-ethyl-N5-methyl-N5-(1-methylpi...)
Show SMILES CCOCCn1nc(CC)c2nc(nc(Nc3cc(C)ccn3)c12)N(C)C1CCN(C)CC1
Show InChI InChI=1S/C24H36N8O/c1-6-19-21-22(32(29-19)14-15-33-7-2)23(26-20-16-17(3)8-11-25-20)28-24(27-21)31(5)18-9-12-30(4)13-10-18/h8,11,16,18H,6-7,9-10,12-15H2,1-5H3,(H,25,26,27,28)
Reactome pathway
n/an/a 0.0900n/an/an/an/an/an/a
Pfizer Global Research and Development
Curated by ChEMBL
Assay Description
Inhibition of PDE5 in human platelet by assessed as hydrolysis of [3H]cGMP scintillation proximity assay
Bioorg Med Chem Lett 20: 3120-4 (2010)
BindingDB Entry DOI: 10.7270/Q2K64K0H