BDBM50318158 8-Hydroxy-5-[(R)-1-hydroxy-2-(5,6-di-n-propylindan-2-ylamino)-ethyl]-1H-quinolin-2-one::CHEMBL1095778
SMILES: CCCc1cc2CC(Cc2cc1CCC)NC[C@H](O)c1ccc(O)c2[nH]c(=O)ccc12
InChI Key: InChIKey=JSWUQIWMTVFTTB-DEOSSOPVSA-N
Data: 1 KI  1 IC50  1 EC50
Activity Spreadsheet -- Enzyme Inhibition Constant Data from BindingDB
Found 3 hits for monomerid = 50318158
Trg + Lig
Ki
nM
ΔG°
kcal/mole
IC50
nM
Kd
nM
EC50/IC50
nM
koff
s-1
kon
M-1s-1
pHTemp
°C
Beta-2 adrenergic receptor
(Homo sapiens (Human))
BDBM50318158
(8-Hydroxy-5-[(R)-1-hydroxy-2-(5,6-di-n-propylindan...)
Show SMILES CCCc1cc2CC(Cc2cc1CCC)NC[C@H](O)c1ccc(O)c2[nH]c(=O)ccc12 |r|
Show InChI InChI=1S/C26H32N2O3/c1-3-5-16-11-18-13-20(14-19(18)12-17(16)6-4-2)27-15-24(30)21-7-9-23(29)26-22(21)8-10-25(31)28-26/h7-12,20,24,27,29-30H,3-6,13-15H2,1-2H3,(H,28,31)/t24-/m0/s1
Reactome pathway
119n/an/an/an/an/an/an/an/a
Novartis Institutes for Biomedical Research
Curated by ChEMBL
Assay Description
Displacement of [125I]cyanopindolol from human recombinant beta2 adrenergic receptor expressed in CHO cells by filtration assay
J Med Chem 53: 3675-84 (2010)
Article DOI: 10.1021/jm100068m
BindingDB Entry DOI: 10.7270/Q27H1JRT
Beta-2 adrenergic receptor
(GUINEA PIG)
BDBM50318158
(8-Hydroxy-5-[(R)-1-hydroxy-2-(5,6-di-n-propylindan...)
Show SMILES CCCc1cc2CC(Cc2cc1CCC)NC[C@H](O)c1ccc(O)c2[nH]c(=O)ccc12 |r|
Show InChI InChI=1S/C26H32N2O3/c1-3-5-16-11-18-13-20(14-19(18)12-17(16)6-4-2)27-15-24(30)21-7-9-23(29)26-22(21)8-10-25(31)28-26/h7-12,20,24,27,29-30H,3-6,13-15H2,1-2H3,(H,28,31)/t24-/m0/s1
n/an/a 20n/an/an/an/an/an/a
Novartis Institutes for Biomedical Research
Curated by ChEMBL
Assay Description
Agonist activity at beta2 adrenergic receptor in guinea pig tracheal strip assessed as inhibition of electrically-induced bronchocontractile response...
J Med Chem 53: 3675-84 (2010)
Article DOI: 10.1021/jm100068m
BindingDB Entry DOI: 10.7270/Q27H1JRT
Beta-2 adrenergic receptor
(Homo sapiens (Human))
BDBM50318158
(8-Hydroxy-5-[(R)-1-hydroxy-2-(5,6-di-n-propylindan...)
Show SMILES CCCc1cc2CC(Cc2cc1CCC)NC[C@H](O)c1ccc(O)c2[nH]c(=O)ccc12 |r|
Show InChI InChI=1S/C26H32N2O3/c1-3-5-16-11-18-13-20(14-19(18)12-17(16)6-4-2)27-15-24(30)21-7-9-23(29)26-22(21)8-10-25(31)28-26/h7-12,20,24,27,29-30H,3-6,13-15H2,1-2H3,(H,28,31)/t24-/m0/s1
Reactome pathway
n/an/an/an/a 14n/an/an/an/a
Novartis Institutes for Biomedical Research
Curated by ChEMBL
Assay Description
Agonist activity at human beta2 adrenergic receptor assessed as increase in cAMP level by whole cell assay
J Med Chem 53: 3675-84 (2010)
Article DOI: 10.1021/jm100068m
BindingDB Entry DOI: 10.7270/Q27H1JRT