null
SMILES: C[C@@H]1CCCN1CCc1ccc2nc(ccc2c1)-c1ccc(s1)C#N
InChI Key: InChIKey=MHAQFNSWCQLYOT-OAHLLOKOSA-N
Activity Spreadsheet -- Enzyme Inhibition Constant Data from BindingDB
Found 5 hits for monomerid = 50319557
Trg + Lig
Ki
nM
ΔG°
kcal/mole
IC50
nM
Kd
nM
EC50/IC50
nM
koff
s-1
kon
M-1s-1
pHTemp
°C
Histamine H3 receptor
(Homo sapiens (Human))
BDBM50319557
((R)-5-(6-(2-(2-methylpyrrolidin-1-yl)ethyl)quinoli...)
Show SMILES C[C@@H]1CCCN1CCc1ccc2nc(ccc2c1)-c1ccc(s1)C#N |r|
Show InChI InChI=1S/C21H21N3S/c1-15-3-2-11-24(15)12-10-16-4-7-19-17(13-16)5-8-20(23-19)21-9-6-18(14-22)25-21/h4-9,13,15H,2-3,10-12H2,1H3/t15-/m1/s1
Reactome pathway
0.300n/an/an/an/an/an/an/an/a
Bioprojet-Biotech
Curated by ChEMBL
Assay Description
Displacement of [125I]Iodoproxyfan from human recombinant histamine H3 receptor by Competitive binding assay
Bioorg Med Chem Lett 21: 5378-83 (2011)
Article DOI: 10.1016/j.bmcl.2011.07.006
BindingDB Entry DOI: 10.7270/Q2VX0GXK
Histamine H3 receptor
(Homo sapiens (Human))
BDBM50319557
((R)-5-(6-(2-(2-methylpyrrolidin-1-yl)ethyl)quinoli...)
Show SMILES C[C@@H]1CCCN1CCc1ccc2nc(ccc2c1)-c1ccc(s1)C#N |r|
Show InChI InChI=1S/C21H21N3S/c1-15-3-2-11-24(15)12-10-16-4-7-19-17(13-16)5-8-20(23-19)21-9-6-18(14-22)25-21/h4-9,13,15H,2-3,10-12H2,1H3/t15-/m1/s1
Reactome pathway
0.320n/an/an/an/an/an/an/an/a
Abbott Laboratories
Curated by ChEMBL
Assay Description
Displacement of [3H]-N-alpha-methylhistamine from human cloned histamine H3 receptor
Bioorg Med Chem Lett 20: 3295-300 (2010)
Article DOI: 10.1016/j.bmcl.2010.04.045
BindingDB Entry DOI: 10.7270/Q2XW4JZN
Histamine H3 receptor
(Rattus norvegicus (rat))
BDBM50319557
((R)-5-(6-(2-(2-methylpyrrolidin-1-yl)ethyl)quinoli...)
Show SMILES C[C@@H]1CCCN1CCc1ccc2nc(ccc2c1)-c1ccc(s1)C#N |r|
Show InChI InChI=1S/C21H21N3S/c1-15-3-2-11-24(15)12-10-16-4-7-19-17(13-16)5-8-20(23-19)21-9-6-18(14-22)25-21/h4-9,13,15H,2-3,10-12H2,1H3/t15-/m1/s1
Reactome pathway
1.20n/an/an/an/an/an/an/an/a
Abbott Laboratories
Curated by ChEMBL
Assay Description
Displacement of [3H]-N-alpha-methylhistamine from rat cloned histamine H3 receptor
Bioorg Med Chem Lett 20: 3295-300 (2010)
Article DOI: 10.1016/j.bmcl.2010.04.045
BindingDB Entry DOI: 10.7270/Q2XW4JZN
Potassium voltage-gated channel subfamily H member 2
(Homo sapiens (Human))
BDBM50319557
((R)-5-(6-(2-(2-methylpyrrolidin-1-yl)ethyl)quinoli...)
Show SMILES C[C@@H]1CCCN1CCc1ccc2nc(ccc2c1)-c1ccc(s1)C#N |r|
Show InChI InChI=1S/C21H21N3S/c1-15-3-2-11-24(15)12-10-16-4-7-19-17(13-16)5-8-20(23-19)21-9-6-18(14-22)25-21/h4-9,13,15H,2-3,10-12H2,1H3/t15-/m1/s1
Reactome pathway
480n/an/an/an/an/an/an/an/a
Abbott Laboratories
Curated by ChEMBL
Assay Description
Displacement of [3H]dofetilide from human ERG expressed in HEK293 cells
Bioorg Med Chem Lett 20: 3295-300 (2010)
Article DOI: 10.1016/j.bmcl.2010.04.045
BindingDB Entry DOI: 10.7270/Q2XW4JZN
Potassium voltage-gated channel subfamily H member 2
(Homo sapiens (Human))
BDBM50319557
((R)-5-(6-(2-(2-methylpyrrolidin-1-yl)ethyl)quinoli...)
Show SMILES C[C@@H]1CCCN1CCc1ccc2nc(ccc2c1)-c1ccc(s1)C#N |r|
Show InChI InChI=1S/C21H21N3S/c1-15-3-2-11-24(15)12-10-16-4-7-19-17(13-16)5-8-20(23-19)21-9-6-18(14-22)25-21/h4-9,13,15H,2-3,10-12H2,1H3/t15-/m1/s1
Reactome pathway
n/an/a 2.00E+3n/an/an/an/an/an/a
Bioprojet-Biotech
Curated by ChEMBL
Assay Description
Displacement of [3H]dofetilide from human recombinant ERG by Competitive binding assay
Bioorg Med Chem Lett 21: 5378-83 (2011)
Article DOI: 10.1016/j.bmcl.2011.07.006
BindingDB Entry DOI: 10.7270/Q2VX0GXK