BDBM50320178 6-(4-CHLOROPHENYL)-7-(2,4-DICHLOROPHENYL)-2,2-DIMETHYL-3,4-DIHYDRO-2H-PYRANO[2,3-B]PYRIDINE-4-CARBOXAMIDE (ENANTIOMERIC MIX)::6-(4-chlorophenyl)-7-(2,4-dichlorophenyl)-2,2-dimethyl-3,4-dihydro-2H-pyrano[2,3-b]pyridine-4-carboxamide::CHEMBL1082305
SMILES: CC1(C)CC(C(N)=O)c2cc(-c3ccc(Cl)cc3)c(nc2O1)-c1ccc(Cl)cc1Cl
InChI Key: InChIKey=YYFWEVOTTPIJNN-UHFFFAOYSA-N
Data: 2 IC50
Activity Spreadsheet -- Enzyme Inhibition Constant Data from BindingDB
Found 2 hits for monomerid = 50320178
Trg + Lig
Ki
nM
ΔG°
kcal/mole
IC50
nM
Kd
nM
EC50/IC50
nM
koff
s-1
kon
M-1s-1
pHTemp
°C
Cannabinoid receptor 2
(Homo sapiens (Human))
BDBM50320178
(6-(4-CHLOROPHENYL)-7-(2,4-DICHLOROPHENYL)-2,2-DIME...)
Show SMILES CC1(C)CC(C(N)=O)c2cc(-c3ccc(Cl)cc3)c(nc2O1)-c1ccc(Cl)cc1Cl
Show InChI InChI=1S/C23H19Cl3N2O2/c1-23(2)11-18(21(27)29)17-10-16(12-3-5-13(24)6-4-12)20(28-22(17)30-23)15-8-7-14(25)9-19(15)26/h3-10,18H,11H2,1-2H3,(H2,27,29)
Reactome pathway
n/an/a 2.48E+3n/an/an/an/an/an/a
Merck Research Laboratories
Curated by ChEMBL
Assay Description
Binding affinity to human CB2 receptor
Bioorg Med Chem Lett 20: 3750-4 (2010)
Article DOI: 10.1016/j.bmcl.2010.04.071
BindingDB Entry DOI: 10.7270/Q22F7NNR
Cannabinoid receptor 1
(Homo sapiens (Human))
BDBM50320178
(6-(4-CHLOROPHENYL)-7-(2,4-DICHLOROPHENYL)-2,2-DIME...)
Show SMILES CC1(C)CC(C(N)=O)c2cc(-c3ccc(Cl)cc3)c(nc2O1)-c1ccc(Cl)cc1Cl
Show InChI InChI=1S/C23H19Cl3N2O2/c1-23(2)11-18(21(27)29)17-10-16(12-3-5-13(24)6-4-12)20(28-22(17)30-23)15-8-7-14(25)9-19(15)26/h3-10,18H,11H2,1-2H3,(H2,27,29)
NCI pathway
Reactome pathway
n/an/a 97n/an/an/an/an/an/a
Merck Research Laboratories
Curated by ChEMBL
Assay Description
Binding affinity to human CB1 receptor
Bioorg Med Chem Lett 20: 3750-4 (2010)
Article DOI: 10.1016/j.bmcl.2010.04.071
BindingDB Entry DOI: 10.7270/Q22F7NNR