BDBM50322061 4-(3,4,5-Trimethoxyphenethyl)aniline::4-[2-(3,4,5-Trimethoxy-phenyl)-ethyl]-phenylamine::CHEMBL86928
SMILES: COc1cc(CCc2ccc(N)cc2)cc(OC)c1OC
InChI Key: InChIKey=BPIQFCQFIYIISU-UHFFFAOYSA-N
Data: 1 IC50
Activity Spreadsheet -- Enzyme Inhibition Constant Data from BindingDB
Found 1 hit for monomerid = 50322061
Trg + Lig
Ki
nM
ΔG°
kcal/mole
IC50
nM
Kd
nM
EC50/IC50
nM
koff
s-1
kon
M-1s-1
pHTemp
°C
Cytochrome P450 19A1
(Homo sapiens (Human))
BDBM50322061
(4-(3,4,5-Trimethoxyphenethyl)aniline | 4-[2-(3,4,5...)
Show SMILES COc1cc(CCc2ccc(N)cc2)cc(OC)c1OC
Show InChI InChI=1S/C17H21NO3/c1-19-15-10-13(11-16(20-2)17(15)21-3)5-4-12-6-8-14(18)9-7-12/h6-11H,4-5,18H2,1-3H3
Reactome pathway
n/an/a 2.79E+3n/an/an/an/an/an/a
Purdue University
Curated by ChEMBL
Assay Description
Inhibition of human aromatase preincubated with NADP+ for 10 mins before substrate addition measured after 30 mins
Bioorg Med Chem 18: 5352-66 (2010)
Article DOI: 10.1016/j.bmc.2010.05.042
BindingDB Entry DOI: 10.7270/Q2PK0H4P