BDBM50323012 2-Trifluoromethyl-4-((1S,2S,6R,7R)-1,7,9-trimethyl-3,5,8,10-tetraoxo-11-oxa-4,9-diaza-tricyclo[5.3.1.0*2,6*]undec-4-yl)-benzonitrile::CHEMBL1210840
SMILES: CN1C(=O)[C@]2(C)O[C@@](C)(c3c(O)n(c(O)c23)-c2ccc(C#N)c(c2)C(F)(F)F)C1=O
InChI Key: InChIKey=DYGOWXYFNGLNMD-HDICACEKSA-N
Data: 1 KI  2 IC50
Activity Spreadsheet -- Enzyme Inhibition Constant Data from BindingDB
Found 3 hits for monomerid = 50323012
Trg + Lig
Ki
nM
ΔG°
kcal/mole
IC50
nM
Kd
nM
EC50/IC50
nM
koff
s-1
kon
M-1s-1
pHTemp
°C
Androgen Receptor
(Homo sapiens (Human))
BDBM50323012
(2-Trifluoromethyl-4-((1S,2S,6R,7R)-1,7,9-trimethyl...)
Show SMILES CN1C(=O)[C@]2(C)O[C@@](C)(c3c(O)n(c(O)c23)-c2ccc(C#N)c(c2)C(F)(F)F)C1=O |r|
Show InChI InChI=1S/C19H14F3N3O5/c1-17-11-12(18(2,30-17)16(29)24(3)15(17)28)14(27)25(13(11)26)9-5-4-8(7-23)10(6-9)19(20,21)22/h4-6,26-27H,1-3H3/t17-,18+
NCI pathway
Reactome pathway
20n/an/an/an/an/an/an/an/a
Bristol-Myers Squibb Company
Curated by ChEMBL
Assay Description
Displacement of [3H]DHT from AR in human MDA-MB-453 cells
Bioorg Med Chem Lett 20: 4491-5 (2010)
Article DOI: 10.1016/j.bmcl.2010.06.034
BindingDB Entry DOI: 10.7270/Q2MK6DVH
Androgen Receptor
(Homo sapiens (Human))
BDBM50323012
(2-Trifluoromethyl-4-((1S,2S,6R,7R)-1,7,9-trimethyl...)
Show SMILES CN1C(=O)[C@]2(C)O[C@@](C)(c3c(O)n(c(O)c23)-c2ccc(C#N)c(c2)C(F)(F)F)C1=O |r|
Show InChI InChI=1S/C19H14F3N3O5/c1-17-11-12(18(2,30-17)16(29)24(3)15(17)28)14(27)25(13(11)26)9-5-4-8(7-23)10(6-9)19(20,21)22/h4-6,26-27H,1-3H3/t17-,18+
NCI pathway
Reactome pathway
n/an/a>5.00E+3n/an/an/an/an/an/a
Bristol-Myers Squibb Company
Curated by ChEMBL
Assay Description
Antagonist activity at wild type human AR expressed in human LNCAP cells by transactivation assay
Bioorg Med Chem Lett 20: 4491-5 (2010)
Article DOI: 10.1016/j.bmcl.2010.06.034
BindingDB Entry DOI: 10.7270/Q2MK6DVH
Androgen Receptor
(Homo sapiens (Human))
BDBM50323012
(2-Trifluoromethyl-4-((1S,2S,6R,7R)-1,7,9-trimethyl...)
Show SMILES CN1C(=O)[C@]2(C)O[C@@](C)(c3c(O)n(c(O)c23)-c2ccc(C#N)c(c2)C(F)(F)F)C1=O |r|
Show InChI InChI=1S/C19H14F3N3O5/c1-17-11-12(18(2,30-17)16(29)24(3)15(17)28)14(27)25(13(11)26)9-5-4-8(7-23)10(6-9)19(20,21)22/h4-6,26-27H,1-3H3/t17-,18+
NCI pathway
Reactome pathway
n/an/a 2.14E+3n/an/an/an/an/an/a
Bristol-Myers Squibb Company
Curated by ChEMBL
Assay Description
Antagonist activity at human wild type AR expressed in human MDA-MB-435 cells by transactivation assay
Bioorg Med Chem Lett 20: 4491-5 (2010)
Article DOI: 10.1016/j.bmcl.2010.06.034
BindingDB Entry DOI: 10.7270/Q2MK6DVH