BDBM50323038 4-[(1S,2S,6R,7R)-9-(6-Chloro-pyrimidin-4-yl)-1,7-dimethyl-3,5-dioxo-11-oxa-4,9-diaza-tricyclo[5.3.1.0*2,6*]undec-4-yl]-2-trifluoromethyl-benzonitrile::CHEMBL1210152
SMILES: C[C@@]12CN(C[C@@](C)(O1)c1c(O)n(c(O)c21)-c1ccc(C#N)c(c1)C(F)(F)F)c1cc(Cl)ncn1
InChI Key: InChIKey=FFYMMHDNGMNATM-OYRHEFFESA-N
Data: 1 KI  2 IC50
Activity Spreadsheet -- Enzyme Inhibition Constant Data from BindingDB
Found 3 hits for monomerid = 50323038
Trg + Lig
Ki
nM
ΔG°
kcal/mole
IC50
nM
Kd
nM
EC50/IC50
nM
koff
s-1
kon
M-1s-1
pHTemp
°C
Androgen Receptor
(Homo sapiens (Human))
BDBM50323038
(4-[(1S,2S,6R,7R)-9-(6-Chloro-pyrimidin-4-yl)-1,7-d...)
Show SMILES C[C@@]12CN(C[C@@](C)(O1)c1c(O)n(c(O)c21)-c1ccc(C#N)c(c1)C(F)(F)F)c1cc(Cl)ncn1 |r|
Show InChI InChI=1S/C22H17ClF3N5O3/c1-20-8-30(15-6-14(23)28-10-29-15)9-21(2,34-20)17-16(20)18(32)31(19(17)33)12-4-3-11(7-27)13(5-12)22(24,25)26/h3-6,10,32-33H,8-9H2,1-2H3/t20-,21+
NCI pathway
Reactome pathway
3.5n/an/an/an/an/an/an/an/a
Bristol-Myers Squibb Company
Curated by ChEMBL
Assay Description
Displacement of [3H]DHT from AR in human MDA-MB-453 cells
Bioorg Med Chem Lett 20: 4491-5 (2010)
Article DOI: 10.1016/j.bmcl.2010.06.034
BindingDB Entry DOI: 10.7270/Q2MK6DVH
Androgen Receptor
(Homo sapiens (Human))
BDBM50323038
(4-[(1S,2S,6R,7R)-9-(6-Chloro-pyrimidin-4-yl)-1,7-d...)
Show SMILES C[C@@]12CN(C[C@@](C)(O1)c1c(O)n(c(O)c21)-c1ccc(C#N)c(c1)C(F)(F)F)c1cc(Cl)ncn1 |r|
Show InChI InChI=1S/C22H17ClF3N5O3/c1-20-8-30(15-6-14(23)28-10-29-15)9-21(2,34-20)17-16(20)18(32)31(19(17)33)12-4-3-11(7-27)13(5-12)22(24,25)26/h3-6,10,32-33H,8-9H2,1-2H3/t20-,21+
NCI pathway
Reactome pathway
n/an/a 11n/an/an/an/an/an/a
Bristol-Myers Squibb Company
Curated by ChEMBL
Assay Description
Antagonist activity at human wild type AR expressed in human MDA-MB-435 cells by transactivation assay
Bioorg Med Chem Lett 20: 4491-5 (2010)
Article DOI: 10.1016/j.bmcl.2010.06.034
BindingDB Entry DOI: 10.7270/Q2MK6DVH
Androgen Receptor
(Homo sapiens (Human))
BDBM50323038
(4-[(1S,2S,6R,7R)-9-(6-Chloro-pyrimidin-4-yl)-1,7-d...)
Show SMILES C[C@@]12CN(C[C@@](C)(O1)c1c(O)n(c(O)c21)-c1ccc(C#N)c(c1)C(F)(F)F)c1cc(Cl)ncn1 |r|
Show InChI InChI=1S/C22H17ClF3N5O3/c1-20-8-30(15-6-14(23)28-10-29-15)9-21(2,34-20)17-16(20)18(32)31(19(17)33)12-4-3-11(7-27)13(5-12)22(24,25)26/h3-6,10,32-33H,8-9H2,1-2H3/t20-,21+
NCI pathway
Reactome pathway
n/an/a 104n/an/an/an/an/an/a
Bristol-Myers Squibb Company
Curated by ChEMBL
Assay Description
Antagonist activity at wild type human AR expressed in human LNCAP cells by transactivation assay
Bioorg Med Chem Lett 20: 4491-5 (2010)
Article DOI: 10.1016/j.bmcl.2010.06.034
BindingDB Entry DOI: 10.7270/Q2MK6DVH