BDBM50323416 2-acetamido-N-(3-(3-tert-butyl-5-(3-phenylureido)-1H-pyrazol-1-yl)benzyl)acetamide::CHEMBL1209274
SMILES: CC(=O)NCC(=O)NCc1cccc(c1)-n1nc(cc1NC(=O)Nc1ccccc1)C(C)(C)C
InChI Key: InChIKey=CRQBPOBTROOFCT-UHFFFAOYSA-N
Data: 2 IC50
Activity Spreadsheet -- Enzyme Inhibition Constant Data from BindingDB
Found 2 hits for monomerid = 50323416
Trg + Lig
Ki
nM
ΔG°
kcal/mole
IC50
nM
Kd
nM
EC50/IC50
nM
koff
s-1
kon
M-1s-1
pHTemp
°C
Mitogen-activated protein kinase 14
(Homo sapiens (Human))
BDBM50323416
(2-acetamido-N-(3-(3-tert-butyl-5-(3-phenylureido)-...)
Show SMILES CC(=O)NCC(=O)NCc1cccc(c1)-n1nc(cc1NC(=O)Nc1ccccc1)C(C)(C)C
Show InChI InChI=1S/C25H30N6O3/c1-17(32)26-16-23(33)27-15-18-9-8-12-20(13-18)31-22(14-21(30-31)25(2,3)4)29-24(34)28-19-10-6-5-7-11-19/h5-14H,15-16H2,1-4H3,(H,26,32)(H,27,33)(H2,28,29,34)
NCI pathway
Reactome pathway
n/an/a 34n/an/an/an/an/an/a
Pfizer Inc.
Curated by ChEMBL
Assay Description
Inhibition of active p38alpha
Bioorg Med Chem Lett 20: 4885-91 (2010)
Article DOI: 10.1016/j.bmcl.2010.06.073
BindingDB Entry DOI: 10.7270/Q2Z31ZT2
Mitogen-activated protein kinase 14
(Homo sapiens (Human))
BDBM50323416
(2-acetamido-N-(3-(3-tert-butyl-5-(3-phenylureido)-...)
Show SMILES CC(=O)NCC(=O)NCc1cccc(c1)-n1nc(cc1NC(=O)Nc1ccccc1)C(C)(C)C
Show InChI InChI=1S/C25H30N6O3/c1-17(32)26-16-23(33)27-15-18-9-8-12-20(13-18)31-22(14-21(30-31)25(2,3)4)29-24(34)28-19-10-6-5-7-11-19/h5-14H,15-16H2,1-4H3,(H,26,32)(H,27,33)(H2,28,29,34)
NCI pathway
Reactome pathway
n/an/a 6n/an/an/an/an/an/a
Pfizer Inc.
Curated by ChEMBL
Assay Description
Inhibition of unactive p38alpha
Bioorg Med Chem Lett 20: 4885-91 (2010)
Article DOI: 10.1016/j.bmcl.2010.06.073
BindingDB Entry DOI: 10.7270/Q2Z31ZT2