BDBM50324898 3-(2-amino-5-chloro-1H-benzimidazol-1-yl)propan-1-ol::3-(2-amino-5-chloro-1H-benzo[d]imidazol-1-yl)propan-1-ol::CHEMBL1221922
SMILES: Nc1nc2cc(Cl)ccc2n1CCCO
InChI Key: InChIKey=NSMVCZCLMLZSOB-UHFFFAOYSA-N
Data: 2 IC50  1 Kd
PDB links: 1 PDB ID matches this monomer.
Activity Spreadsheet -- Enzyme Inhibition Constant Data from BindingDB
Found 3 hits for monomerid = 50324898
Trg + Lig
Ki
nM
ΔG°
kcal/mole
IC50
nM
Kd
nM
EC50/IC50
nM
koff
s-1
kon
M-1s-1
pHTemp
°C
Beta-secretase 1
(Homo sapiens (Human))
BDBM50324898
(3-(2-amino-5-chloro-1H-benzimidazol-1-yl)propan-1-...)
Show SMILES Nc1nc2cc(Cl)ccc2n1CCCO
Show InChI InChI=1S/C10H12ClN3O/c11-7-2-3-9-8(6-7)13-10(12)14(9)4-1-5-15/h2-3,6,15H,1,4-5H2,(H2,12,13)
n/an/a 7.70E+5n/an/an/an/an/an/a
Evotec UK Ltd
Curated by ChEMBL
Assay Description
Inhibition of BACE1 assessed as amyloid beta secretion by cell based assay
Bioorg Med Chem Lett 20: 5329-33 (2010)
Article DOI: 10.1016/j.bmcl.2010.06.089
BindingDB Entry DOI: 10.7270/Q2VQ32W7
3D
3D Structure (crystal)
7,8-dihydro-8-oxoguanine triphosphatase
(Homo sapiens (Human))
BDBM50324898
(3-(2-amino-5-chloro-1H-benzimidazol-1-yl)propan-1-...)
Show SMILES Nc1nc2cc(Cl)ccc2n1CCCO
Show InChI InChI=1S/C10H12ClN3O/c11-7-2-3-9-8(6-7)13-10(12)14(9)4-1-5-15/h2-3,6,15H,1,4-5H2,(H2,12,13)
n/an/an/a 1.50E+4n/an/an/an/an/a
University of Zurich
Curated by ChEMBL
Assay Description
Binding affinity to recombinant His-tagged MTH1 (unknown origin) expressed in Escherichia coli BL21(DE3) assessed as dissociation constant by isother...
Eur J Med Chem 175: 107-113 (2019)
Article DOI: 10.1016/j.ejmech.2019.04.037
7,8-dihydro-8-oxoguanine triphosphatase
(Homo sapiens (Human))
BDBM50324898
(3-(2-amino-5-chloro-1H-benzimidazol-1-yl)propan-1-...)
Show SMILES Nc1nc2cc(Cl)ccc2n1CCCO
Show InChI InChI=1S/C10H12ClN3O/c11-7-2-3-9-8(6-7)13-10(12)14(9)4-1-5-15/h2-3,6,15H,1,4-5H2,(H2,12,13)
n/an/a 2.80E+4n/an/an/an/an/an/a
University of Zurich
Curated by ChEMBL
Assay Description
Inhibition of recombinant His-tagged MTH1 (unknown origin) expressed in Escherichia coli BL21(DE3) cells using dGTP as substrate incubated for 15 min...
Eur J Med Chem 175: 107-113 (2019)
Article DOI: 10.1016/j.ejmech.2019.04.037