BDBM50328262 5-(2-chlorophenyl)-7-nitro-3-(trifluoromethyl)-2,10-dihydrobenzo[e]pyrazolo[4,3-b][1,4]diazepine::CHEMBL1258938
SMILES: [O-][N+](=O)c1ccc2Nc3[nH]nc(c3N=C(c3ccccc3Cl)c2c1)C(F)(F)F
InChI Key: InChIKey=GMDYYDWJVZBIRM-UHFFFAOYSA-N
Data: 1 IC50
Activity Spreadsheet -- Enzyme Inhibition Constant Data from BindingDB
Found 1 hit for monomerid = 50328262
Trg + Lig
Ki
nM
ΔG°
kcal/mole
IC50
nM
Kd
nM
EC50/IC50
nM
koff
s-1
kon
M-1s-1
pHTemp
°C
CDK2/Cyclin E/G1/S-specific cyclin E2
(Homo sapiens (Human))
BDBM50328262
(5-(2-chlorophenyl)-7-nitro-3-(trifluoromethyl)-2,1...)
Show SMILES [O-][N+](=O)c1ccc2Nc3[nH]nc(c3N=C(c3ccccc3Cl)c2c1)C(F)(F)F |t:14|
Show InChI InChI=1S/C17H9ClF3N5O2/c18-11-4-2-1-3-9(11)13-10-7-8(26(27)28)5-6-12(10)22-16-14(23-13)15(24-25-16)17(19,20)21/h1-7H,(H2,22,24,25)
n/an/a 232n/an/an/an/an/an/a
Hoffmann-La Roche Inc.
Curated by ChEMBL
Assay Description
Inhibition of CDK2-cyclin E
Bioorg Med Chem Lett 20: 5984-7 (2010)
Article DOI: 10.1016/j.bmcl.2010.08.079
BindingDB Entry DOI: 10.7270/Q21C1X42