BDBM50328272 5-(2-fluorophenyl)-3-methyl-2,10-dihydrobenzo[e]pyrazolo[4,3-b][1,4]diazepine::CHEMBL1257552
SMILES: Cc1n[nH]c2Nc3ccccc3C(=Nc12)c1ccccc1F
InChI Key: InChIKey=JWYXJDKUBNYUOI-UHFFFAOYSA-N
Data: 1 IC50
Activity Spreadsheet -- Enzyme Inhibition Constant Data from BindingDB
Found 1 hit for monomerid = 50328272
Trg + Lig
Ki
nM
ΔG°
kcal/mole
IC50
nM
Kd
nM
EC50/IC50
nM
koff
s-1
kon
M-1s-1
pHTemp
°C
CDK2/Cyclin E/G1/S-specific cyclin E2
(Homo sapiens (Human))
BDBM50328272
(5-(2-fluorophenyl)-3-methyl-2,10-dihydrobenzo[e]py...)
Show SMILES Cc1n[nH]c2Nc3ccccc3C(=Nc12)c1ccccc1F |c:13|
Show InChI InChI=1S/C17H13FN4/c1-10-15-17(22-21-10)19-14-9-5-3-7-12(14)16(20-15)11-6-2-4-8-13(11)18/h2-9H,1H3,(H2,19,21,22)
n/an/a 64n/an/an/an/an/an/a
Hoffmann-La Roche Inc.
Curated by ChEMBL
Assay Description
Inhibition of CDK2-cyclin E
Bioorg Med Chem Lett 20: 5984-7 (2010)
Article DOI: 10.1016/j.bmcl.2010.08.079
BindingDB Entry DOI: 10.7270/Q21C1X42