BDBM50329519 (R)-2-amino-4-(3-(2-fluoropyridin-3-yl)phenyl)-4-(4-methoxyphenyl)-1-methyl-1H-imidazol-5(4H)-one::CHEMBL1271344
SMILES: COc1ccc(cc1)[C@@]1(N=C(N)N(C)C1=O)c1cccc(c1)-c1cccnc1F
InChI Key: InChIKey=RIWZSRFUUJMOEH-JOCHJYFZSA-N
Data: 3 IC50  1 EC50
Activity Spreadsheet -- Enzyme Inhibition Constant Data from BindingDB
Found 4 hits for monomerid = 50329519
Trg + Lig
Ki
nM
ΔG°
kcal/mole
IC50
nM
Kd
nM
EC50/IC50
nM
koff
s-1
kon
M-1s-1
pHTemp
°C
Beta-secretase 1
(Homo sapiens (Human))
BDBM50329519
((R)-2-amino-4-(3-(2-fluoropyridin-3-yl)phenyl)-4-(...)
Show SMILES COc1ccc(cc1)[C@@]1(N=C(N)N(C)C1=O)c1cccc(c1)-c1cccnc1F |r,t:10|
Show InChI InChI=1S/C22H19FN4O2/c1-27-20(28)22(26-21(27)24,15-8-10-17(29-2)11-9-15)16-6-3-5-14(13-16)18-7-4-12-25-19(18)23/h3-13H,1-2H3,(H2,24,26)/t22-/m1/s1
n/an/an/an/a 140n/an/an/an/a
Pfizer Inc.
Curated by ChEMBL
Assay Description
Inhibition of human recombinant BACE1 expressed in CHO cells assessed as reduction in amyloid beta level by sandwich ELISA
Bioorg Med Chem Lett 20: 6597-605 (2010)
Article DOI: 10.1016/j.bmcl.2010.09.029
BindingDB Entry DOI: 10.7270/Q2C829JF
Cathepsin D
(Homo sapiens (Human))
BDBM50329519
((R)-2-amino-4-(3-(2-fluoropyridin-3-yl)phenyl)-4-(...)
Show SMILES COc1ccc(cc1)[C@@]1(N=C(N)N(C)C1=O)c1cccc(c1)-c1cccnc1F |r,t:10|
Show InChI InChI=1S/C22H19FN4O2/c1-27-20(28)22(26-21(27)24,15-8-10-17(29-2)11-9-15)16-6-3-5-14(13-16)18-7-4-12-25-19(18)23/h3-13H,1-2H3,(H2,24,26)/t22-/m1/s1
NCI pathway
Reactome pathway
n/an/a 1.17E+3n/an/an/an/an/an/a
Pfizer Inc.
Curated by ChEMBL
Assay Description
Inhibition of cathepsin D by FRET assay
Bioorg Med Chem Lett 20: 6597-605 (2010)
Article DOI: 10.1016/j.bmcl.2010.09.029
BindingDB Entry DOI: 10.7270/Q2C829JF
Beta-secretase 2
(Homo sapiens (Human))
BDBM50329519
((R)-2-amino-4-(3-(2-fluoropyridin-3-yl)phenyl)-4-(...)
Show SMILES COc1ccc(cc1)[C@@]1(N=C(N)N(C)C1=O)c1cccc(c1)-c1cccnc1F |r,t:10|
Show InChI InChI=1S/C22H19FN4O2/c1-27-20(28)22(26-21(27)24,15-8-10-17(29-2)11-9-15)16-6-3-5-14(13-16)18-7-4-12-25-19(18)23/h3-13H,1-2H3,(H2,24,26)/t22-/m1/s1
n/an/a 120n/an/an/an/an/an/a
Pfizer Inc.
Curated by ChEMBL
Assay Description
Inhibition of BACE2 by FRET assay
Bioorg Med Chem Lett 20: 6597-605 (2010)
Article DOI: 10.1016/j.bmcl.2010.09.029
BindingDB Entry DOI: 10.7270/Q2C829JF
Beta-secretase 1
(Homo sapiens (Human))
BDBM50329519
((R)-2-amino-4-(3-(2-fluoropyridin-3-yl)phenyl)-4-(...)
Show SMILES COc1ccc(cc1)[C@@]1(N=C(N)N(C)C1=O)c1cccc(c1)-c1cccnc1F |r,t:10|
Show InChI InChI=1S/C22H19FN4O2/c1-27-20(28)22(26-21(27)24,15-8-10-17(29-2)11-9-15)16-6-3-5-14(13-16)18-7-4-12-25-19(18)23/h3-13H,1-2H3,(H2,24,26)/t22-/m1/s1
n/an/a 30n/an/an/an/an/an/a
Pfizer Inc.
Curated by ChEMBL
Assay Description
Inhibition of human BACE1 by FRET assay
Bioorg Med Chem Lett 20: 6597-605 (2010)
Article DOI: 10.1016/j.bmcl.2010.09.029
BindingDB Entry DOI: 10.7270/Q2C829JF