BDBM50330515 1-methyl-5-(4-methylpiperazin-1-yl)-3-(naphthalen-1-ylsulfonyl)-1H-indazole::CHEMBL1277564
SMILES: CN1CCN(CC1)c1ccc2n(C)nc(c2c1)S(=O)(=O)c1cccc2ccccc12
InChI Key: InChIKey=ONLLIDMEPCMUBJ-UHFFFAOYSA-N
Data: 1 KI  1 IC50
Activity Spreadsheet -- Enzyme Inhibition Constant Data from BindingDB
Found 2 hits for monomerid = 50330515
Trg + Lig
Ki
nM
ΔG°
kcal/mole
IC50
nM
Kd
nM
EC50/IC50
nM
koff
s-1
kon
M-1s-1
pHTemp
°C
5-hydroxytryptamine receptor 6
(Homo sapiens (Human))
BDBM50330515
(1-methyl-5-(4-methylpiperazin-1-yl)-3-(naphthalen-...)
Show SMILES CN1CCN(CC1)c1ccc2n(C)nc(c2c1)S(=O)(=O)c1cccc2ccccc12
Show InChI InChI=1S/C23H24N4O2S/c1-25-12-14-27(15-13-25)18-10-11-21-20(16-18)23(24-26(21)2)30(28,29)22-9-5-7-17-6-3-4-8-19(17)22/h3-11,16H,12-15H2,1-2H3
Reactome pathway
1.70n/an/an/an/an/an/an/an/a
Wyeth Research
Curated by ChEMBL
Assay Description
Displacement of [3H]LSD from human cloned 5HT6 receptor expressed in human HeLa cells
J Med Chem 53: 7639-46 (2010)
Article DOI: 10.1021/jm1007825
BindingDB Entry DOI: 10.7270/Q2GQ6XZ6
5-hydroxytryptamine receptor 6
(Homo sapiens (Human))
BDBM50330515
(1-methyl-5-(4-methylpiperazin-1-yl)-3-(naphthalen-...)
Show SMILES CN1CCN(CC1)c1ccc2n(C)nc(c2c1)S(=O)(=O)c1cccc2ccccc12
Show InChI InChI=1S/C23H24N4O2S/c1-25-12-14-27(15-13-25)18-10-11-21-20(16-18)23(24-26(21)2)30(28,29)22-9-5-7-17-6-3-4-8-19(17)22/h3-11,16H,12-15H2,1-2H3
Reactome pathway
n/an/a 1.70n/an/an/an/an/an/a
Wyeth Research
Curated by ChEMBL
Assay Description
Antagonist activity at human cloned 5HT6 receptor expressed in human HeLa cells by cyclase assay
J Med Chem 53: 7639-46 (2010)
Article DOI: 10.1021/jm1007825
BindingDB Entry DOI: 10.7270/Q2GQ6XZ6