BDBM50331251 (R)-4-(benzyloxy)-1-(1-(2-(2-(hydroxymethyl)pyrrolidin-1-yl)ethyl)-1H-indazol-5-yl)pyridin-2(1H)-one::CHEMBL1289169
SMILES: OC[C@H]1CCCN1CCn1ncc2cc(ccc12)-n1ccc(OCc2ccccc2)cc1=O
InChI Key: InChIKey=GQTWGOYRIPIZBV-HSZRJFAPSA-N
Data: 1 KI  1 IC50
Activity Spreadsheet -- Enzyme Inhibition Constant Data from BindingDB
Found 2 hits for monomerid = 50331251
Trg + Lig
Ki
nM
ΔG°
kcal/mole
IC50
nM
Kd
nM
EC50/IC50
nM
koff
s-1
kon
M-1s-1
pHTemp
°C
Melanin-concentrating hormone receptor 1
(Homo sapiens (Human))
BDBM50331251
((R)-4-(benzyloxy)-1-(1-(2-(2-(hydroxymethyl)pyrrol...)
Show SMILES OC[C@H]1CCCN1CCn1ncc2cc(ccc12)-n1ccc(OCc2ccccc2)cc1=O |r|
Show InChI InChI=1S/C26H28N4O3/c31-18-23-7-4-11-28(23)13-14-30-25-9-8-22(15-21(25)17-27-30)29-12-10-24(16-26(29)32)33-19-20-5-2-1-3-6-20/h1-3,5-6,8-10,12,15-17,23,31H,4,7,11,13-14,18-19H2/t23-/m1/s1
Reactome pathway
3.10n/an/an/an/an/an/an/an/a
AMRI
Curated by ChEMBL
Assay Description
Displacement of [3H]4-(benzyloxy)-1-(1-(2-(pyrrolidin-1-yl)ethyl)-1H-indazol-5-yl)pyridin-2(1H)-one from MCH-1 receptor expressed in CHO-K1 cells
Bioorg Med Chem Lett 20: 7015-9 (2010)
Article DOI: 10.1016/j.bmcl.2010.09.039
BindingDB Entry DOI: 10.7270/Q2P55NSM
Potassium voltage-gated channel subfamily H member 2
(Homo sapiens (Human))
BDBM50331251
((R)-4-(benzyloxy)-1-(1-(2-(2-(hydroxymethyl)pyrrol...)
Show SMILES OC[C@H]1CCCN1CCn1ncc2cc(ccc12)-n1ccc(OCc2ccccc2)cc1=O |r|
Show InChI InChI=1S/C26H28N4O3/c31-18-23-7-4-11-28(23)13-14-30-25-9-8-22(15-21(25)17-27-30)29-12-10-24(16-26(29)32)33-19-20-5-2-1-3-6-20/h1-3,5-6,8-10,12,15-17,23,31H,4,7,11,13-14,18-19H2/t23-/m1/s1
Reactome pathway
n/an/a 2.30E+3n/an/an/an/an/an/a
AMRI
Curated by ChEMBL
Assay Description
Inhibition of human ERG expressed in HEK cells by mini-patch clamp assay
Bioorg Med Chem Lett 20: 7015-9 (2010)
Article DOI: 10.1016/j.bmcl.2010.09.039
BindingDB Entry DOI: 10.7270/Q2P55NSM