BDBM50331261 3-(5-methyl-1H-indol-2-yl)-1H-indazole::CHEMBL1289007
SMILES: Cc1ccc2[nH]c(cc2c1)-c1n[nH]c2ccccc12
InChI Key: InChIKey=TWCBDFOBFWDISE-UHFFFAOYSA-N
Data: 1 IC50
Activity Spreadsheet -- Enzyme Inhibition Constant Data from BindingDB
Found 1 hit for monomerid = 50331261
Trg + Lig
Ki
nM
ΔG°
kcal/mole
IC50
nM
Kd
nM
EC50/IC50
nM
koff
s-1
kon
M-1s-1
pHTemp
°C
Tyrosine-protein kinase ITK/TSK
(Homo sapiens (Human))
BDBM50331261
(3-(5-methyl-1H-indol-2-yl)-1H-indazole | CHEMBL128...)
Show SMILES Cc1ccc2[nH]c(cc2c1)-c1n[nH]c2ccccc12
Show InChI InChI=1S/C16H13N3/c1-10-6-7-13-11(8-10)9-15(17-13)16-12-4-2-3-5-14(12)18-19-16/h2-9,17H,1H3,(H,18,19)
Reactome pathway
n/an/a 350n/an/an/an/an/an/a
Nycomed GmbH
Curated by ChEMBL
Assay Description
Inhibition of recombinant GST- tagged full-length ITK expressed in baculovirus expression system after 30 mins by scintillation proximity assay
Bioorg Med Chem Lett 20: 6998-7003 (2010)
Article DOI: 10.1016/j.bmcl.2010.09.119
BindingDB Entry DOI: 10.7270/Q2JD4X29