BDBM50333015 1-(3-{2-[4-(2-Methyl-5-quinolinyl)-1-piperazinyl]ethyl}phenyl)-2-imidazolidinone::CHEMBL1631540
SMILES: Cc1ccc2c(cccc2n1)N1CCN(CCc2cccc(c2)N2CCNC2=O)CC1
InChI Key: InChIKey=ANGUXJDGJCHGOG-UHFFFAOYSA-N
Data: 1 KI  8 IC50
Activity Spreadsheet -- Enzyme Inhibition Constant Data from BindingDB
Found 9 hits for monomerid = 50333015
Trg + Lig
Ki
nM
ΔG°
kcal/mole
IC50
nM
Kd
nM
EC50/IC50
nM
koff
s-1
kon
M-1s-1
pHTemp
°C
Potassium voltage-gated channel subfamily H member 2
(Homo sapiens (Human))
BDBM50333015
(1-(3-{2-[4-(2-Methyl-5-quinolinyl)-1-piperazinyl]e...)
Show SMILES Cc1ccc2c(cccc2n1)N1CCN(CCc2cccc(c2)N2CCNC2=O)CC1
Show InChI InChI=1S/C25H29N5O/c1-19-8-9-22-23(27-19)6-3-7-24(22)29-16-14-28(15-17-29)12-10-20-4-2-5-21(18-20)30-13-11-26-25(30)31/h2-9,18H,10-17H2,1H3,(H,26,31)
Reactome pathway
1.26E+4n/an/an/an/an/an/an/an/a
TBA
Curated by ChEMBL
Assay Description
Displacement of [3H]dofetilide from human ERG by SPA
J Med Chem 53: 8228-8240 (2010)
Article DOI: 10.1021/jm100714c
BindingDB Entry DOI: 10.7270/Q2SF2WD4
Cytochrome P450 3A4
(Homo sapiens (Human))
BDBM50333015
(1-(3-{2-[4-(2-Methyl-5-quinolinyl)-1-piperazinyl]e...)
Show SMILES Cc1ccc2c(cccc2n1)N1CCN(CCc2cccc(c2)N2CCNC2=O)CC1
Show InChI InChI=1S/C25H29N5O/c1-19-8-9-22-23(27-19)6-3-7-24(22)29-16-14-28(15-17-29)12-10-20-4-2-5-21(18-20)30-13-11-26-25(30)31/h2-9,18H,10-17H2,1H3,(H,26,31)
Reactome pathway
n/an/a 6.70E+4n/an/an/an/an/an/a
TBA
Curated by ChEMBL
Assay Description
Inhibition of human recombinant CYP3A4
J Med Chem 53: 8228-8240 (2010)
Article DOI: 10.1021/jm100714c
BindingDB Entry DOI: 10.7270/Q2SF2WD4
Cytochrome P450 2D6
(Homo sapiens (Human))
BDBM50333015
(1-(3-{2-[4-(2-Methyl-5-quinolinyl)-1-piperazinyl]e...)
Show SMILES Cc1ccc2c(cccc2n1)N1CCN(CCc2cccc(c2)N2CCNC2=O)CC1
Show InChI InChI=1S/C25H29N5O/c1-19-8-9-22-23(27-19)6-3-7-24(22)29-16-14-28(15-17-29)12-10-20-4-2-5-21(18-20)30-13-11-26-25(30)31/h2-9,18H,10-17H2,1H3,(H,26,31)
n/an/a 8.60E+4n/an/an/an/an/an/a
TBA
Curated by ChEMBL
Assay Description
Inhibition of human recombinant CYP2D6
J Med Chem 53: 8228-8240 (2010)
Article DOI: 10.1021/jm100714c
BindingDB Entry DOI: 10.7270/Q2SF2WD4
Cytochrome P450 3A4
(Homo sapiens (Human))
BDBM50333015
(1-(3-{2-[4-(2-Methyl-5-quinolinyl)-1-piperazinyl]e...)
Show SMILES Cc1ccc2c(cccc2n1)N1CCN(CCc2cccc(c2)N2CCNC2=O)CC1
Show InChI InChI=1S/C25H29N5O/c1-19-8-9-22-23(27-19)6-3-7-24(22)29-16-14-28(15-17-29)12-10-20-4-2-5-21(18-20)30-13-11-26-25(30)31/h2-9,18H,10-17H2,1H3,(H,26,31)
Reactome pathway
n/an/a 2.10E+4n/an/an/an/an/an/a
TBA
Curated by ChEMBL
Assay Description
Inhibition of CYP3A4 in human liver microsomes using nifedipine as probe
J Med Chem 53: 8228-8240 (2010)
Article DOI: 10.1021/jm100714c
BindingDB Entry DOI: 10.7270/Q2SF2WD4
Cytochrome P450 2C9
(Homo sapiens (Human))
BDBM50333015
(1-(3-{2-[4-(2-Methyl-5-quinolinyl)-1-piperazinyl]e...)
Show SMILES Cc1ccc2c(cccc2n1)N1CCN(CCc2cccc(c2)N2CCNC2=O)CC1
Show InChI InChI=1S/C25H29N5O/c1-19-8-9-22-23(27-19)6-3-7-24(22)29-16-14-28(15-17-29)12-10-20-4-2-5-21(18-20)30-13-11-26-25(30)31/h2-9,18H,10-17H2,1H3,(H,26,31)
Reactome pathway
n/an/a 6.00E+4n/an/an/an/an/an/a
TBA
Curated by ChEMBL
Assay Description
Inhibition of human recombinant CYP2C9
J Med Chem 53: 8228-8240 (2010)
Article DOI: 10.1021/jm100714c
BindingDB Entry DOI: 10.7270/Q2SF2WD4
Cytochrome P450 1A2
(Homo sapiens (Human))
BDBM50333015
(1-(3-{2-[4-(2-Methyl-5-quinolinyl)-1-piperazinyl]e...)
Show SMILES Cc1ccc2c(cccc2n1)N1CCN(CCc2cccc(c2)N2CCNC2=O)CC1
Show InChI InChI=1S/C25H29N5O/c1-19-8-9-22-23(27-19)6-3-7-24(22)29-16-14-28(15-17-29)12-10-20-4-2-5-21(18-20)30-13-11-26-25(30)31/h2-9,18H,10-17H2,1H3,(H,26,31)
Reactome pathway
n/an/a 9.60E+4n/an/an/an/an/an/a
TBA
Curated by ChEMBL
Assay Description
Inhibition of human recombinant CYP1A2
J Med Chem 53: 8228-8240 (2010)
Article DOI: 10.1021/jm100714c
BindingDB Entry DOI: 10.7270/Q2SF2WD4
Cytochrome P450 3A4
(Homo sapiens (Human))
BDBM50333015
(1-(3-{2-[4-(2-Methyl-5-quinolinyl)-1-piperazinyl]e...)
Show SMILES Cc1ccc2c(cccc2n1)N1CCN(CCc2cccc(c2)N2CCNC2=O)CC1
Show InChI InChI=1S/C25H29N5O/c1-19-8-9-22-23(27-19)6-3-7-24(22)29-16-14-28(15-17-29)12-10-20-4-2-5-21(18-20)30-13-11-26-25(30)31/h2-9,18H,10-17H2,1H3,(H,26,31)
Reactome pathway
n/an/a 2.10E+4n/an/an/an/an/an/a
TBA
Curated by ChEMBL
Assay Description
Inhibition of CYP3A4 in human liver microsomes using atorvastatin as probe
J Med Chem 53: 8228-8240 (2010)
Article DOI: 10.1021/jm100714c
BindingDB Entry DOI: 10.7270/Q2SF2WD4
Cytochrome P450 3A4
(Homo sapiens (Human))
BDBM50333015
(1-(3-{2-[4-(2-Methyl-5-quinolinyl)-1-piperazinyl]e...)
Show SMILES Cc1ccc2c(cccc2n1)N1CCN(CCc2cccc(c2)N2CCNC2=O)CC1
Show InChI InChI=1S/C25H29N5O/c1-19-8-9-22-23(27-19)6-3-7-24(22)29-16-14-28(15-17-29)12-10-20-4-2-5-21(18-20)30-13-11-26-25(30)31/h2-9,18H,10-17H2,1H3,(H,26,31)
Reactome pathway
n/an/a 2.10E+4n/an/an/an/an/an/a
TBA
Curated by ChEMBL
Assay Description
Inhibition of CYP3A4 in human liver microsomes using midazolam as probe
J Med Chem 53: 8228-8240 (2010)
Article DOI: 10.1021/jm100714c
BindingDB Entry DOI: 10.7270/Q2SF2WD4
Cytochrome P450 2C19
(Homo sapiens (Human))
BDBM50333015
(1-(3-{2-[4-(2-Methyl-5-quinolinyl)-1-piperazinyl]e...)
Show SMILES Cc1ccc2c(cccc2n1)N1CCN(CCc2cccc(c2)N2CCNC2=O)CC1
Show InChI InChI=1S/C25H29N5O/c1-19-8-9-22-23(27-19)6-3-7-24(22)29-16-14-28(15-17-29)12-10-20-4-2-5-21(18-20)30-13-11-26-25(30)31/h2-9,18H,10-17H2,1H3,(H,26,31)
Reactome pathway
n/an/a 7.60E+4n/an/an/an/an/an/a
TBA
Curated by ChEMBL
Assay Description
Inhibition of human recombinant CYP219
J Med Chem 53: 8228-8240 (2010)
Article DOI: 10.1021/jm100714c
BindingDB Entry DOI: 10.7270/Q2SF2WD4