BDBM50333843 (R)-2-(3-chloro-2-fluoro-7-(4-fluoro-N-methylphenylsulfonamido)-6,7,8,9-tetrahydropyrido[1,2-a]indol-10-yl)acetic acid::CHEMBL1643782
SMILES: CN([C@@H]1CCc2c(CC(O)=O)c3cc(F)c(Cl)cc3n2C1)S(=O)(=O)c1ccc(F)cc1
InChI Key: InChIKey=JFYFIDPAUZVPFW-CYBMUJFWSA-N
Data: 3 KI  1 IC50
Activity Spreadsheet -- Enzyme Inhibition Constant Data from BindingDB
Found 4 hits for monomerid = 50333843
Trg + Lig
Ki
nM
ΔG°
kcal/mole
IC50
nM
Kd
nM
EC50/IC50
nM
koff
s-1
kon
M-1s-1
pHTemp
°C
G protein-coupled receptor 44
(Homo sapiens (Human))
BDBM50333843
((R)-2-(3-chloro-2-fluoro-7-(4-fluoro-N-methylpheny...)
Show SMILES CN([C@@H]1CCc2c(CC(O)=O)c3cc(F)c(Cl)cc3n2C1)S(=O)(=O)c1ccc(F)cc1 |r|
Show InChI InChI=1S/C21H19ClF2N2O4S/c1-25(31(29,30)14-5-2-12(23)3-6-14)13-4-7-19-16(9-21(27)28)15-8-18(24)17(22)10-20(15)26(19)11-13/h2-3,5-6,8,10,13H,4,7,9,11H2,1H3,(H,27,28)/t13-/m1/s1
Reactome pathway
3.70n/an/an/an/an/an/an/an/a
Merck Frosst Centre for Therapeutic Research
Curated by ChEMBL
Assay Description
Binding affinity to human recombinant CRTH2 receptor by cell based radioligand equilibrium competition assay
Bioorg Med Chem Lett 21: 288-93 (2010)
Article DOI: 10.1016/j.bmcl.2010.11.015
BindingDB Entry DOI: 10.7270/Q2959HTH
Prostanoid DP receptor
(Homo sapiens (Human))
BDBM50333843
((R)-2-(3-chloro-2-fluoro-7-(4-fluoro-N-methylpheny...)
Show SMILES CN([C@@H]1CCc2c(CC(O)=O)c3cc(F)c(Cl)cc3n2C1)S(=O)(=O)c1ccc(F)cc1 |r|
Show InChI InChI=1S/C21H19ClF2N2O4S/c1-25(31(29,30)14-5-2-12(23)3-6-14)13-4-7-19-16(9-21(27)28)15-8-18(24)17(22)10-20(15)26(19)11-13/h2-3,5-6,8,10,13H,4,7,9,11H2,1H3,(H,27,28)/t13-/m1/s1
48n/an/an/an/an/an/an/an/a
Merck Frosst Centre for Therapeutic Research
Curated by ChEMBL
Assay Description
Binding affinity to prostanoid DP1 receptor
Bioorg Med Chem Lett 21: 288-93 (2010)
Article DOI: 10.1016/j.bmcl.2010.11.015
BindingDB Entry DOI: 10.7270/Q2959HTH
Prostanoid TP receptor
(Homo sapiens (Human))
BDBM50333843
((R)-2-(3-chloro-2-fluoro-7-(4-fluoro-N-methylpheny...)
Show SMILES CN([C@@H]1CCc2c(CC(O)=O)c3cc(F)c(Cl)cc3n2C1)S(=O)(=O)c1ccc(F)cc1 |r|
Show InChI InChI=1S/C21H19ClF2N2O4S/c1-25(31(29,30)14-5-2-12(23)3-6-14)13-4-7-19-16(9-21(27)28)15-8-18(24)17(22)10-20(15)26(19)11-13/h2-3,5-6,8,10,13H,4,7,9,11H2,1H3,(H,27,28)/t13-/m1/s1
1.84E+3n/an/an/an/an/an/an/an/a
Merck Frosst Centre for Therapeutic Research
Curated by ChEMBL
Assay Description
Binding affinity to thromboxane receptor
Bioorg Med Chem Lett 21: 288-93 (2010)
Article DOI: 10.1016/j.bmcl.2010.11.015
BindingDB Entry DOI: 10.7270/Q2959HTH
G protein-coupled receptor 44
(Homo sapiens (Human))
BDBM50333843
((R)-2-(3-chloro-2-fluoro-7-(4-fluoro-N-methylpheny...)
Show SMILES CN([C@@H]1CCc2c(CC(O)=O)c3cc(F)c(Cl)cc3n2C1)S(=O)(=O)c1ccc(F)cc1 |r|
Show InChI InChI=1S/C21H19ClF2N2O4S/c1-25(31(29,30)14-5-2-12(23)3-6-14)13-4-7-19-16(9-21(27)28)15-8-18(24)17(22)10-20(15)26(19)11-13/h2-3,5-6,8,10,13H,4,7,9,11H2,1H3,(H,27,28)/t13-/m1/s1
Reactome pathway
n/an/a 5.70n/an/an/an/an/an/a
Merck Frosst Centre for Therapeutic Research
Curated by ChEMBL
Assay Description
Antagonist activity at human recombinant CRTH2 receptor expressed in HEK293 cells assessed as inhibition of DK-PGD2-induced intracellular cAMP format...
Bioorg Med Chem Lett 21: 288-93 (2010)
Article DOI: 10.1016/j.bmcl.2010.11.015
BindingDB Entry DOI: 10.7270/Q2959HTH