BDBM50333878 CHEMBL1172006::Frangulin A
SMILES: C[C@@H]1O[C@@H](Oc2cc(O)c3C(=O)c4c(O)cc(C)cc4C(=O)c3c2)[C@H](O)[C@H](O)[C@H]1O
InChI Key: InChIKey=DTTVUKLWJFJOHO-FUCRAMRQSA-N
Data: 1 KI  2 IC50
Activity Spreadsheet -- Enzyme Inhibition Constant Data from BindingDB
Found 3 hits for monomerid = 50333878
Trg + Lig
Ki
nM
ΔG°
kcal/mole
IC50
nM
Kd
nM
EC50/IC50
nM
koff
s-1
kon
M-1s-1
pHTemp
°C
Purinergic receptor P2Y12
(Homo sapiens (Human))
BDBM50333878
(CHEMBL1172006 | Frangulin A)
Show SMILES C[C@@H]1O[C@@H](Oc2cc(O)c3C(=O)c4c(O)cc(C)cc4C(=O)c3c2)[C@H](O)[C@H](O)[C@H]1O |r|
Show InChI InChI=1S/C21H20O9/c1-7-3-10-14(12(22)4-7)18(26)15-11(17(10)25)5-9(6-13(15)23)30-21-20(28)19(27)16(24)8(2)29-21/h3-6,8,16,19-24,27-28H,1-2H3/t8-,16-,19+,20+,21-/m0/s1
Reactome pathway
>1.00E+4n/an/an/an/an/an/an/an/a
University of Bonn
Curated by ChEMBL
Assay Description
Displacement of [3H]PSB0413 from human platelet P2Y12 receptor
J Med Chem 52: 3784-93 (2009)
Article DOI: 10.1021/jm9003297
BindingDB Entry DOI: 10.7270/Q2NK3FZF
Thioredoxin reductase 1, cytoplasmic
(Rattus norvegicus)
BDBM50333878
(CHEMBL1172006 | Frangulin A)
Show SMILES C[C@@H]1O[C@@H](Oc2cc(O)c3C(=O)c4c(O)cc(C)cc4C(=O)c3c2)[C@H](O)[C@H](O)[C@H]1O |r|
Show InChI InChI=1S/C21H20O9/c1-7-3-10-14(12(22)4-7)18(26)15-11(17(10)25)5-9(6-13(15)23)30-21-20(28)19(27)16(24)8(2)29-21/h3-6,8,16,19-24,27-28H,1-2H3/t8-,16-,19+,20+,21-/m0/s1
n/an/a>2.00E+5n/an/an/an/an/an/a
University of Padova
Curated by ChEMBL
Assay Description
Inhibition of rat liver cytosolic TrxR1 by spectrophotometry
Bioorg Med Chem 19: 631-41 (2011)
Article DOI: 10.1016/j.bmc.2010.10.045
BindingDB Entry DOI: 10.7270/Q25D8S4N
Thioredoxin reductase 2, mitochondrial
(Rattus norvegicus)
BDBM50333878
(CHEMBL1172006 | Frangulin A)
Show SMILES C[C@@H]1O[C@@H](Oc2cc(O)c3C(=O)c4c(O)cc(C)cc4C(=O)c3c2)[C@H](O)[C@H](O)[C@H]1O |r|
Show InChI InChI=1S/C21H20O9/c1-7-3-10-14(12(22)4-7)18(26)15-11(17(10)25)5-9(6-13(15)23)30-21-20(28)19(27)16(24)8(2)29-21/h3-6,8,16,19-24,27-28H,1-2H3/t8-,16-,19+,20+,21-/m0/s1
Reactome pathway
n/an/a>2.00E+5n/an/an/an/an/an/a
University of Padova
Curated by ChEMBL
Assay Description
Inhibition of rat liver mitochondrial TrxR2 by spectrophotometry
Bioorg Med Chem 19: 631-41 (2011)
Article DOI: 10.1016/j.bmc.2010.10.045
BindingDB Entry DOI: 10.7270/Q25D8S4N