BDBM50334029 1-(3-(4-(2,4-dichlorophenyl)-1H-imidazol-2-yl)benzyl)-4-fluoropiperidine::CHEMBL1644732
SMILES: FC1CCN(Cc2cccc(c2)-c2nc(c[nH]2)-c2ccc(Cl)cc2Cl)CC1
InChI Key: InChIKey=IPPBEGLUKNRALZ-UHFFFAOYSA-N
Data: 2 EC50
Activity Spreadsheet -- Enzyme Inhibition Constant Data from BindingDB
Found 2 hits for monomerid = 50334029
Trg + Lig
Ki
nM
ΔG°
kcal/mole
IC50
nM
Kd
nM
EC50/IC50
nM
koff
s-1
kon
M-1s-1
pHTemp
°C
Cannabinoid receptor 2
(Homo sapiens (Human))
BDBM50334029
(1-(3-(4-(2,4-dichlorophenyl)-1H-imidazol-2-yl)benz...)
Show SMILES FC1CCN(Cc2cccc(c2)-c2nc(c[nH]2)-c2ccc(Cl)cc2Cl)CC1
Show InChI InChI=1S/C21H20Cl2FN3/c22-16-4-5-18(19(23)11-16)20-12-25-21(26-20)15-3-1-2-14(10-15)13-27-8-6-17(24)7-9-27/h1-5,10-12,17H,6-9,13H2,(H,25,26)
Reactome pathway
n/an/an/an/a 10n/an/an/an/a
Merck Research Laboratory
Curated by ChEMBL
Assay Description
Agonist activity at human cloned CB2 receptor expressed in CHO cells assessed as inhibition of forskolin-induced cAMP accumulation
Bioorg Med Chem Lett 21: 182-5 (2010)
Article DOI: 10.1016/j.bmcl.2010.11.044
BindingDB Entry DOI: 10.7270/Q20P108G
Cannabinoid receptor 1
(Homo sapiens (Human))
BDBM50334029
(1-(3-(4-(2,4-dichlorophenyl)-1H-imidazol-2-yl)benz...)
Show SMILES FC1CCN(Cc2cccc(c2)-c2nc(c[nH]2)-c2ccc(Cl)cc2Cl)CC1
Show InChI InChI=1S/C21H20Cl2FN3/c22-16-4-5-18(19(23)11-16)20-12-25-21(26-20)15-3-1-2-14(10-15)13-27-8-6-17(24)7-9-27/h1-5,10-12,17H,6-9,13H2,(H,25,26)
NCI pathway
Reactome pathway
n/an/an/an/a 2.45E+3n/an/an/an/a
Merck Research Laboratory
Curated by ChEMBL
Assay Description
Agonist activity at human cloned CB1 receptor expressed in CHO cells assessed as inhibition of forskolin-induced cAMP accumulation
Bioorg Med Chem Lett 21: 182-5 (2010)
Article DOI: 10.1016/j.bmcl.2010.11.044
BindingDB Entry DOI: 10.7270/Q20P108G