BDBM50334215 (+/-)-threo-3-Iodomethylphenidate::CHEMBL1641691
SMILES: COC(=O)[C@@H]([C@H]1CCCCN1)c1cccc(I)c1
InChI Key: InChIKey=OFLGSFKBBRGLOC-CHWSQXEVSA-N
Data: 2 KI  1 IC50
Activity Spreadsheet -- Enzyme Inhibition Constant Data from BindingDB
Found 3 hits for monomerid = 50334215
Trg + Lig
Ki
nM
ΔG°
kcal/mole
IC50
nM
Kd
nM
EC50/IC50
nM
koff
s-1
kon
M-1s-1
pHTemp
°C
Sodium-dependent dopamine transporter
(Homo sapiens (Human))
BDBM50334215
((+/-)-threo-3-Iodomethylphenidate | CHEMBL1641691)
Show SMILES COC(=O)[C@@H]([C@H]1CCCCN1)c1cccc(I)c1 |r|
Show InChI InChI=1S/C14H18INO2/c1-18-14(17)13(12-7-2-3-8-16-12)10-5-4-6-11(15)9-10/h4-6,9,12-13,16H,2-3,7-8H2,1H3/t12-,13-/m1/s1
NCI pathway
Reactome pathway
4.5n/an/an/an/an/an/an/an/a
Duquesne University Mylan School of Pharmacy
Curated by ChEMBL
Assay Description
Displacement of [3H]WIN-35428 from human DAT stably expressed in mouse N2A cells by scintillation countnig
Bioorg Med Chem 19: 504-12 (2011)
Article DOI: 10.1016/j.bmc.2010.11.002
BindingDB Entry DOI: 10.7270/Q29Z9567
Sodium-dependent dopamine transporter
(Homo sapiens (Human))
BDBM50334215
((+/-)-threo-3-Iodomethylphenidate | CHEMBL1641691)
Show SMILES COC(=O)[C@@H]([C@H]1CCCCN1)c1cccc(I)c1 |r|
Show InChI InChI=1S/C14H18INO2/c1-18-14(17)13(12-7-2-3-8-16-12)10-5-4-6-11(15)9-10/h4-6,9,12-13,16H,2-3,7-8H2,1H3/t12-,13-/m1/s1
NCI pathway
Reactome pathway
4.5n/an/an/an/an/an/an/an/a
TBA
Curated by ChEMBL
Assay Description
Displacement of [3H]WIN-35,428 from human DAT expressed in mouse N2A cells after 15 mins by liquid scintillation counting
ACS Med Chem Lett 3: 378-382 (2012)
Article DOI: 10.1021/ml3000098
BindingDB Entry DOI: 10.7270/Q2FX7BHG
Sodium-dependent dopamine transporter
(Homo sapiens (Human))
BDBM50334215
((+/-)-threo-3-Iodomethylphenidate | CHEMBL1641691)
Show SMILES COC(=O)[C@@H]([C@H]1CCCCN1)c1cccc(I)c1 |r|
Show InChI InChI=1S/C14H18INO2/c1-18-14(17)13(12-7-2-3-8-16-12)10-5-4-6-11(15)9-10/h4-6,9,12-13,16H,2-3,7-8H2,1H3/t12-,13-/m1/s1
NCI pathway
Reactome pathway
n/an/a 14n/an/an/an/an/an/a
Duquesne University Mylan School of Pharmacy
Curated by ChEMBL
Assay Description
Inhibition of [3H]dopamine uptake at human DAT expressed in mouse N2A cells
Bioorg Med Chem 19: 504-12 (2011)
Article DOI: 10.1016/j.bmc.2010.11.002
BindingDB Entry DOI: 10.7270/Q29Z9567