null
SMILES: OP(O)(=O)Cc1ccccn1
InChI Key: InChIKey=WVWCWWLEFNGDBC-UHFFFAOYSA-N
PDB links: 1 PDB ID matches this monomer.
Activity Spreadsheet -- Enzyme Inhibition Constant Data from BindingDB
Found 2 hits for monomerid = 50335492
Trg + Lig
Ki
nM
ΔG°
kcal/mole
IC50
nM
Kd
nM
EC50/IC50
nM
koff
s-1
kon
M-1s-1
pHTemp
°C
1-deoxy-D-xylulose 5-phosphate reductoisomerase
(Mycobacterium tuberculosis)
BDBM50335492
((pyridin-2-ylmethyl)phosphonic acid | CHEMBL161524...)
Show SMILES OP(O)(=O)Cc1ccccn1
Show InChI InChI=1S/C6H8NO3P/c8-11(9,10)5-6-3-1-2-4-7-6/h1-4H,5H2,(H2,8,9,10)
1.60E+3n/an/an/an/an/an/an/an/a
Baylor College of Medicine
Curated by ChEMBL
Assay Description
Inhibition of Mycobacterium tuberculosis recombinant DXR expressed in Escherichia coli BL21 (DE3) using DXP as substrate and MgCl2 as cofactor preinc...
J Med Chem 54: 4721-34 (2011)
Article DOI: 10.1021/jm200363d
BindingDB Entry DOI: 10.7270/Q2NK3FCT
1-deoxy-D-xylulose 5-phosphate reductoisomerase
(Escherichia coli)
BDBM50335492
((pyridin-2-ylmethyl)phosphonic acid | CHEMBL161524...)
Show SMILES OP(O)(=O)Cc1ccccn1
Show InChI InChI=1S/C6H8NO3P/c8-11(9,10)5-6-3-1-2-4-7-6/h1-4H,5H2,(H2,8,9,10)
n/an/a 4.60E+3n/an/an/an/an/an/a
Baylor College of Medicine
Curated by ChEMBL
Assay Description
Inhibition of Escherichia coli DXR
ACS Med Chem Lett 2: 165-170 (2011)
Article DOI: 10.1021/ml100243r
BindingDB Entry DOI: 10.7270/Q2XD12NV
3D
3D Structure (crystal)