BDBM50337744 CHEMBL1683447::N-((2S,4S)-1-(4-(2,4-dichlorophenethyl)piperidin-1-ylsulfonyl)-4-(5-fluoropyrimidin-2-yl)-2-methylpentan-2-yl)-N-hydroxyformamide::US10322143, Compound 6
SMILES: C[C@@H](C[C@@](C)(CS(=O)(=O)N1CCC(CCc2ccc(Cl)cc2Cl)CC1)N(O)C=O)c1ncc(F)cn1
InChI Key: InChIKey=QGHSUDAHRCBUBZ-XDHUDOTRSA-N
Data: 2 IC50
Activity Spreadsheet -- Enzyme Inhibition Constant Data from BindingDB
Found 2 hits for monomerid = 50337744
Trg + Lig
Ki
nM
ΔG°
kcal/mole
IC50
nM
Kd
nM
EC50/IC50
nM
koff
s-1
kon
M-1s-1
pHTemp
°C
A disintegrin and metalloproteinase with thrombospondin motifs 4 (ADAMTS-4)
(Homo sapiens (Human))
BDBM50337744
(CHEMBL1683447 | N-((2S,4S)-1-(4-(2,4-dichlorophene...)
Show SMILES C[C@@H](C[C@@](C)(CS(=O)(=O)N1CCC(CCc2ccc(Cl)cc2Cl)CC1)N(O)C=O)c1ncc(F)cn1 |r|
Show InChI InChI=1S/C24H31Cl2FN4O4S/c1-17(23-28-13-21(27)14-29-23)12-24(2,31(33)16-32)15-36(34,35)30-9-7-18(8-10-30)3-4-19-5-6-20(25)11-22(19)26/h5-6,11,13-14,16-18,33H,3-4,7-10,12,15H2,1-2H3/t17-,24-/m0/s1
Reactome pathway
US Patent
n/an/a 1.10n/an/an/an/an/an/a
AstraZeneca
Assay Description
Protein concentrations were measured using the Micro BCA Protein Assay Kit (Pierce/Thermo Scientific, IL). Sample buffer was mixed with 5-25 μg ...
Bioorg Med Chem Lett 19: 4280-3 (2009)
BindingDB Entry DOI: 10.7270/Q2BC41VN
A disintegrin and metalloproteinase with thrombospondin motifs 4 (ADAMTS-4)
(Homo sapiens (Human))
BDBM50337744
(CHEMBL1683447 | N-((2S,4S)-1-(4-(2,4-dichlorophene...)
Show SMILES C[C@@H](C[C@@](C)(CS(=O)(=O)N1CCC(CCc2ccc(Cl)cc2Cl)CC1)N(O)C=O)c1ncc(F)cn1 |r|
Show InChI InChI=1S/C24H31Cl2FN4O4S/c1-17(23-28-13-21(27)14-29-23)12-24(2,31(33)16-32)15-36(34,35)30-9-7-18(8-10-30)3-4-19-5-6-20(25)11-22(19)26/h5-6,11,13-14,16-18,33H,3-4,7-10,12,15H2,1-2H3/t17-,24-/m0/s1
Reactome pathway
n/an/a 1.10n/an/an/an/an/an/a
AstraZeneca
Curated by ChEMBL
Assay Description
Inhibition of ADAMTS-4 assessed as substrate cleavage by measuring increase in fluorescence after 16 hrs
Bioorg Med Chem Lett 21: 1376-81 (2011)
Article DOI: 10.1016/j.bmcl.2011.01.036
BindingDB Entry DOI: 10.7270/Q2DV1K5M