BDBM50341040 1-(4-amino-6-methyl-1,3,5-triazin-2-yl)-N-(1H-pyrazol-3-yl)-1H-benzimidazol-2-amine::1-(4-amino-6-methyl-1,3,5-triazin-2-yl)-N-(1H-pyrazol-3-yl)-1H-benzo[d]imidazol-2-amine::CHEMBL1615183
SMILES: Cc1nc(N)nc(n1)-n1c(Nc2ccn[nH]2)nc2ccccc12
InChI Key: InChIKey=DMMFPXAFVNDPCA-UHFFFAOYSA-N
Data: 10 IC50
Activity Spreadsheet -- Enzyme Inhibition Constant Data from BindingDB
Found 10 hits for monomerid = 50341040
Trg + Lig
Ki
nM
ΔG°
kcal/mole
IC50
nM
Kd
nM
EC50/IC50
nM
koff
s-1
kon
M-1s-1
pHTemp
°C
Phosphatidylinositol 4,5-bisphosphate 3-kinase catalytic subunit alpha isoform
(Homo sapiens (Human))
BDBM50341040
(1-(4-amino-6-methyl-1,3,5-triazin-2-yl)-N-(1H-pyra...)
Show SMILES Cc1nc(N)nc(n1)-n1c(Nc2ccn[nH]2)nc2ccccc12
Show InChI InChI=1S/C14H13N9/c1-8-17-12(15)21-13(18-8)23-10-5-3-2-4-9(10)19-14(23)20-11-6-7-16-22-11/h2-7H,1H3,(H2,15,17,18,21)(H2,16,19,20,22)
NCI pathway
Reactome pathway
n/an/a 800n/an/an/an/an/an/a
Amgen Inc
Curated by ChEMBL
Assay Description
Inhibition of PI3Kalpha
Bioorg Med Chem Lett 21: 2064-70 (2011)
Article DOI: 10.1016/j.bmcl.2011.02.007
BindingDB Entry DOI: 10.7270/Q2FT8MBW
Phosphatidylinositol 4,5-bisphosphate 3-kinase catalytic subunit beta isoform
(Homo sapiens (Human))
BDBM50341040
(1-(4-amino-6-methyl-1,3,5-triazin-2-yl)-N-(1H-pyra...)
Show SMILES Cc1nc(N)nc(n1)-n1c(Nc2ccn[nH]2)nc2ccccc12
Show InChI InChI=1S/C14H13N9/c1-8-17-12(15)21-13(18-8)23-10-5-3-2-4-9(10)19-14(23)20-11-6-7-16-22-11/h2-7H,1H3,(H2,15,17,18,21)(H2,16,19,20,22)
NCI pathway
Reactome pathway
n/an/a 870n/an/an/an/an/an/a
Amgen Inc
Curated by ChEMBL
Assay Description
Inhibition of PI3Kbeta
Bioorg Med Chem Lett 21: 2064-70 (2011)
Article DOI: 10.1016/j.bmcl.2011.02.007
BindingDB Entry DOI: 10.7270/Q2FT8MBW
Phosphatidylinositol 4,5-bisphosphate 3-kinase catalytic subunit delta isoform
(Homo sapiens (Human))
BDBM50341040
(1-(4-amino-6-methyl-1,3,5-triazin-2-yl)-N-(1H-pyra...)
Show SMILES Cc1nc(N)nc(n1)-n1c(Nc2ccn[nH]2)nc2ccccc12
Show InChI InChI=1S/C14H13N9/c1-8-17-12(15)21-13(18-8)23-10-5-3-2-4-9(10)19-14(23)20-11-6-7-16-22-11/h2-7H,1H3,(H2,15,17,18,21)(H2,16,19,20,22)
NCI pathway
Reactome pathway
n/an/a 510n/an/an/an/an/an/a
Amgen Inc
Curated by ChEMBL
Assay Description
Inhibition of PI3Kdelta
Bioorg Med Chem Lett 21: 2064-70 (2011)
Article DOI: 10.1016/j.bmcl.2011.02.007
BindingDB Entry DOI: 10.7270/Q2FT8MBW
Phosphatidylinositol 4,5-bisphosphate 3-kinase catalytic subunit gamma isoform
(Homo sapiens (Human))
BDBM50341040
(1-(4-amino-6-methyl-1,3,5-triazin-2-yl)-N-(1H-pyra...)
Show SMILES Cc1nc(N)nc(n1)-n1c(Nc2ccn[nH]2)nc2ccccc12
Show InChI InChI=1S/C14H13N9/c1-8-17-12(15)21-13(18-8)23-10-5-3-2-4-9(10)19-14(23)20-11-6-7-16-22-11/h2-7H,1H3,(H2,15,17,18,21)(H2,16,19,20,22)
NCI pathway
Reactome pathway
n/an/a 320n/an/an/an/an/an/a
Amgen Inc
Curated by ChEMBL
Assay Description
Inhibition of PI3Kgamma
Bioorg Med Chem Lett 21: 2064-70 (2011)
Article DOI: 10.1016/j.bmcl.2011.02.007
BindingDB Entry DOI: 10.7270/Q2FT8MBW
Phosphatidylinositol 4,5-bisphosphate 3-kinase catalytic subunit alpha isoform
(Homo sapiens (Human))
BDBM50341040
(1-(4-amino-6-methyl-1,3,5-triazin-2-yl)-N-(1H-pyra...)
Show SMILES Cc1nc(N)nc(n1)-n1c(Nc2ccn[nH]2)nc2ccccc12
Show InChI InChI=1S/C14H13N9/c1-8-17-12(15)21-13(18-8)23-10-5-3-2-4-9(10)19-14(23)20-11-6-7-16-22-11/h2-7H,1H3,(H2,15,17,18,21)(H2,16,19,20,22)
NCI pathway
Reactome pathway
n/an/a 798n/an/an/an/an/an/a
Amgen Inc.
Curated by ChEMBL
Assay Description
Inhibition of PI3Kalpha by AlphaScreen assay
Bioorg Med Chem Lett 22: 4967-74 (2012)
Article DOI: 10.1016/j.bmcl.2012.06.033
BindingDB Entry DOI: 10.7270/Q2BK1DHN
Serine/threonine-protein kinase mTOR
(Homo sapiens (Human))
BDBM50341040
(1-(4-amino-6-methyl-1,3,5-triazin-2-yl)-N-(1H-pyra...)
Show SMILES Cc1nc(N)nc(n1)-n1c(Nc2ccn[nH]2)nc2ccccc12
Show InChI InChI=1S/C14H13N9/c1-8-17-12(15)21-13(18-8)23-10-5-3-2-4-9(10)19-14(23)20-11-6-7-16-22-11/h2-7H,1H3,(H2,15,17,18,21)(H2,16,19,20,22)
NCI pathway
Reactome pathway
n/an/a 55n/an/an/an/an/an/a
Amgen Inc
Curated by ChEMBL
Assay Description
Inhibition of mTOR in human U-87 cells assessed as inhibition of phosphorylation of AKT at S473
Bioorg Med Chem Lett 21: 2064-70 (2011)
Article DOI: 10.1016/j.bmcl.2011.02.007
BindingDB Entry DOI: 10.7270/Q2FT8MBW
Serine/threonine-protein kinase mTOR
(Homo sapiens (Human))
BDBM50341040
(1-(4-amino-6-methyl-1,3,5-triazin-2-yl)-N-(1H-pyra...)
Show SMILES Cc1nc(N)nc(n1)-n1c(Nc2ccn[nH]2)nc2ccccc12
Show InChI InChI=1S/C14H13N9/c1-8-17-12(15)21-13(18-8)23-10-5-3-2-4-9(10)19-14(23)20-11-6-7-16-22-11/h2-7H,1H3,(H2,15,17,18,21)(H2,16,19,20,22)
NCI pathway
Reactome pathway
n/an/a 27n/an/an/an/an/an/a
Amgen Inc
Curated by ChEMBL
Assay Description
Inhibition of mTOR assessed as inhibition of phosphorylation of 4EBP1 by Lantha-Screen enzyme assay
Bioorg Med Chem Lett 21: 2064-70 (2011)
Article DOI: 10.1016/j.bmcl.2011.02.007
BindingDB Entry DOI: 10.7270/Q2FT8MBW
Serine/threonine-protein kinase mTOR
(Homo sapiens (Human))
BDBM50341040
(1-(4-amino-6-methyl-1,3,5-triazin-2-yl)-N-(1H-pyra...)
Show SMILES Cc1nc(N)nc(n1)-n1c(Nc2ccn[nH]2)nc2ccccc12
Show InChI InChI=1S/C14H13N9/c1-8-17-12(15)21-13(18-8)23-10-5-3-2-4-9(10)19-14(23)20-11-6-7-16-22-11/h2-7H,1H3,(H2,15,17,18,21)(H2,16,19,20,22)
NCI pathway
Reactome pathway
n/an/a 23n/an/an/an/an/an/a
Amgen Inc.
Curated by ChEMBL
Assay Description
Inhibition of mTOR by LanthaScreen assay
Bioorg Med Chem Lett 22: 4967-74 (2012)
Article DOI: 10.1016/j.bmcl.2012.06.033
BindingDB Entry DOI: 10.7270/Q2BK1DHN
Phosphatidylinositol 4,5-bisphosphate 3-kinase catalytic subunit beta isoform
(Homo sapiens (Human))
BDBM50341040
(1-(4-amino-6-methyl-1,3,5-triazin-2-yl)-N-(1H-pyra...)
Show SMILES Cc1nc(N)nc(n1)-n1c(Nc2ccn[nH]2)nc2ccccc12
Show InChI InChI=1S/C14H13N9/c1-8-17-12(15)21-13(18-8)23-10-5-3-2-4-9(10)19-14(23)20-11-6-7-16-22-11/h2-7H,1H3,(H2,15,17,18,21)(H2,16,19,20,22)
NCI pathway
Reactome pathway
n/an/a 875n/an/an/an/an/an/a
Amgen Inc.
Curated by ChEMBL
Assay Description
Inhibition of PI3Kbeta by AlphaScreen assay
Bioorg Med Chem Lett 22: 4967-74 (2012)
Article DOI: 10.1016/j.bmcl.2012.06.033
BindingDB Entry DOI: 10.7270/Q2BK1DHN
Serine/threonine-protein kinase mTOR
(Homo sapiens (Human))
BDBM50341040
(1-(4-amino-6-methyl-1,3,5-triazin-2-yl)-N-(1H-pyra...)
Show SMILES Cc1nc(N)nc(n1)-n1c(Nc2ccn[nH]2)nc2ccccc12
Show InChI InChI=1S/C14H13N9/c1-8-17-12(15)21-13(18-8)23-10-5-3-2-4-9(10)19-14(23)20-11-6-7-16-22-11/h2-7H,1H3,(H2,15,17,18,21)(H2,16,19,20,22)
NCI pathway
Reactome pathway
n/an/a 390n/an/an/an/an/an/a
Amgen Inc
Curated by ChEMBL
Assay Description
Inhibition of mTOR in human U-87 cells assessed as inhibition of phosphorylation of 4EBP1 at T37/46
Bioorg Med Chem Lett 21: 2064-70 (2011)
Article DOI: 10.1016/j.bmcl.2011.02.007
BindingDB Entry DOI: 10.7270/Q2FT8MBW