BDBM50341244 (2S,5R)-4-[2-Amino-6-(3-amino-1H-indazol-6-yl)-4-pyrimidinyl]-5-methyl-N-phenyl-2-morpholinecarboxamide::CHEMBL1765741
SMILES: C[C@@H]1CO[C@@H](CN1c1cc(nc(N)n1)-c1ccc2c(N)n[nH]c2c1)C(=O)Nc1ccccc1
InChI Key: InChIKey=JTGMDPHLGBACAV-YJYMSZOUSA-N
Data: 8 IC50
Activity Spreadsheet -- Enzyme Inhibition Constant Data from BindingDB
Found 8 hits for monomerid = 50341244
Trg + Lig
Ki
nM
ΔG°
kcal/mole
IC50
nM
Kd
nM
EC50/IC50
nM
koff
s-1
kon
M-1s-1
pHTemp
°C
TGF-beta receptor type-1
(Homo sapiens (Human))
BDBM50341244
((2S,5R)-4-[2-Amino-6-(3-amino-1H-indazol-6-yl)-4-p...)
Show SMILES C[C@@H]1CO[C@@H](CN1c1cc(nc(N)n1)-c1ccc2c(N)n[nH]c2c1)C(=O)Nc1ccccc1 |r|
Show InChI InChI=1S/C23H24N8O2/c1-13-12-33-19(22(32)26-15-5-3-2-4-6-15)11-31(13)20-10-17(27-23(25)28-20)14-7-8-16-18(9-14)29-30-21(16)24/h2-10,13,19H,11-12H2,1H3,(H,26,32)(H3,24,29,30)(H2,25,27,28)/t13-,19+/m1/s1
n/an/a<1.00E+4n/an/an/an/an/an/a
GlaxoSmithKline
Curated by ChEMBL
Assay Description
Inhibition of ALK5
J Med Chem 54: 1871-95 (2011)
Article DOI: 10.1021/jm101527u
BindingDB Entry DOI: 10.7270/Q2HQ406Q
Aurora kinase B
(Homo sapiens (Human))
BDBM50341244
((2S,5R)-4-[2-Amino-6-(3-amino-1H-indazol-6-yl)-4-p...)
Show SMILES C[C@@H]1CO[C@@H](CN1c1cc(nc(N)n1)-c1ccc2c(N)n[nH]c2c1)C(=O)Nc1ccccc1 |r|
Show InChI InChI=1S/C23H24N8O2/c1-13-12-33-19(22(32)26-15-5-3-2-4-6-15)11-31(13)20-10-17(27-23(25)28-20)14-7-8-16-18(9-14)29-30-21(16)24/h2-10,13,19H,11-12H2,1H3,(H,26,32)(H3,24,29,30)(H2,25,27,28)/t13-,19+/m1/s1
Reactome pathway
n/an/a 316n/an/an/an/an/an/a
GlaxoSmithKline
Curated by ChEMBL
Assay Description
Inhibition of aurora B
J Med Chem 54: 1871-95 (2011)
Article DOI: 10.1021/jm101527u
BindingDB Entry DOI: 10.7270/Q2HQ406Q
Aurora kinase A
(Homo sapiens (Human))
BDBM50341244
((2S,5R)-4-[2-Amino-6-(3-amino-1H-indazol-6-yl)-4-p...)
Show SMILES C[C@@H]1CO[C@@H](CN1c1cc(nc(N)n1)-c1ccc2c(N)n[nH]c2c1)C(=O)Nc1ccccc1 |r|
Show InChI InChI=1S/C23H24N8O2/c1-13-12-33-19(22(32)26-15-5-3-2-4-6-15)11-31(13)20-10-17(27-23(25)28-20)14-7-8-16-18(9-14)29-30-21(16)24/h2-10,13,19H,11-12H2,1H3,(H,26,32)(H3,24,29,30)(H2,25,27,28)/t13-,19+/m1/s1
NCI pathway
Reactome pathway
n/an/a 200n/an/an/an/an/an/a
GlaxoSmithKline
Curated by ChEMBL
Assay Description
Inhibition of aurora A
J Med Chem 54: 1871-95 (2011)
Article DOI: 10.1021/jm101527u
BindingDB Entry DOI: 10.7270/Q2HQ406Q
3-phosphoinositide dependent protein kinase-1
(Homo sapiens (Human))
BDBM50341244
((2S,5R)-4-[2-Amino-6-(3-amino-1H-indazol-6-yl)-4-p...)
Show SMILES C[C@@H]1CO[C@@H](CN1c1cc(nc(N)n1)-c1ccc2c(N)n[nH]c2c1)C(=O)Nc1ccccc1 |r|
Show InChI InChI=1S/C23H24N8O2/c1-13-12-33-19(22(32)26-15-5-3-2-4-6-15)11-31(13)20-10-17(27-23(25)28-20)14-7-8-16-18(9-14)29-30-21(16)24/h2-10,13,19H,11-12H2,1H3,(H,26,32)(H3,24,29,30)(H2,25,27,28)/t13-,19+/m1/s1
NCI pathway
Reactome pathway
n/an/a>2.93E+4n/an/an/an/an/an/a
GlaxoSmithKline
Curated by ChEMBL
Assay Description
Inhibition of PDK1-mediated AKT phosphorylation at Ser473 in human PC3 cells by ELISA
J Med Chem 54: 1871-95 (2011)
Article DOI: 10.1021/jm101527u
BindingDB Entry DOI: 10.7270/Q2HQ406Q
3-phosphoinositide dependent protein kinase-1
(Homo sapiens (Human))
BDBM50341244
((2S,5R)-4-[2-Amino-6-(3-amino-1H-indazol-6-yl)-4-p...)
Show SMILES C[C@@H]1CO[C@@H](CN1c1cc(nc(N)n1)-c1ccc2c(N)n[nH]c2c1)C(=O)Nc1ccccc1 |r|
Show InChI InChI=1S/C23H24N8O2/c1-13-12-33-19(22(32)26-15-5-3-2-4-6-15)11-31(13)20-10-17(27-23(25)28-20)14-7-8-16-18(9-14)29-30-21(16)24/h2-10,13,19H,11-12H2,1H3,(H,26,32)(H3,24,29,30)(H2,25,27,28)/t13-,19+/m1/s1
NCI pathway
Reactome pathway
n/an/a 5n/an/an/an/an/an/a
GlaxoSmithKline
Curated by ChEMBL
Assay Description
Inhibition of PDK1
J Med Chem 54: 1871-95 (2011)
Article DOI: 10.1021/jm101527u
BindingDB Entry DOI: 10.7270/Q2HQ406Q
3-phosphoinositide dependent protein kinase-1
(Homo sapiens (Human))
BDBM50341244
((2S,5R)-4-[2-Amino-6-(3-amino-1H-indazol-6-yl)-4-p...)
Show SMILES C[C@@H]1CO[C@@H](CN1c1cc(nc(N)n1)-c1ccc2c(N)n[nH]c2c1)C(=O)Nc1ccccc1 |r|
Show InChI InChI=1S/C23H24N8O2/c1-13-12-33-19(22(32)26-15-5-3-2-4-6-15)11-31(13)20-10-17(27-23(25)28-20)14-7-8-16-18(9-14)29-30-21(16)24/h2-10,13,19H,11-12H2,1H3,(H,26,32)(H3,24,29,30)(H2,25,27,28)/t13-,19+/m1/s1
NCI pathway
Reactome pathway
n/an/a 594n/an/an/an/an/an/a
GlaxoSmithKline
Curated by ChEMBL
Assay Description
Inhibition of PDK1-mediated RSK phosphorylation at Ser221 residue in human PC3 cells by ELISA
J Med Chem 54: 1871-95 (2011)
Article DOI: 10.1021/jm101527u
BindingDB Entry DOI: 10.7270/Q2HQ406Q
3-phosphoinositide dependent protein kinase-1
(Homo sapiens (Human))
BDBM50341244
((2S,5R)-4-[2-Amino-6-(3-amino-1H-indazol-6-yl)-4-p...)
Show SMILES C[C@@H]1CO[C@@H](CN1c1cc(nc(N)n1)-c1ccc2c(N)n[nH]c2c1)C(=O)Nc1ccccc1 |r|
Show InChI InChI=1S/C23H24N8O2/c1-13-12-33-19(22(32)26-15-5-3-2-4-6-15)11-31(13)20-10-17(27-23(25)28-20)14-7-8-16-18(9-14)29-30-21(16)24/h2-10,13,19H,11-12H2,1H3,(H,26,32)(H3,24,29,30)(H2,25,27,28)/t13-,19+/m1/s1
NCI pathway
Reactome pathway
n/an/a 264n/an/an/an/an/an/a
GlaxoSmithKline
Curated by ChEMBL
Assay Description
Inhibition of PDK1-mediated AKT phosphorylation at Thr308 residue in human PC3 cells by ELISA
J Med Chem 54: 1871-95 (2011)
Article DOI: 10.1021/jm101527u
BindingDB Entry DOI: 10.7270/Q2HQ406Q
Rho-associated protein kinase 1
(Homo sapiens (Human))
BDBM50341244
((2S,5R)-4-[2-Amino-6-(3-amino-1H-indazol-6-yl)-4-p...)
Show SMILES C[C@@H]1CO[C@@H](CN1c1cc(nc(N)n1)-c1ccc2c(N)n[nH]c2c1)C(=O)Nc1ccccc1 |r|
Show InChI InChI=1S/C23H24N8O2/c1-13-12-33-19(22(32)26-15-5-3-2-4-6-15)11-31(13)20-10-17(27-23(25)28-20)14-7-8-16-18(9-14)29-30-21(16)24/h2-10,13,19H,11-12H2,1H3,(H,26,32)(H3,24,29,30)(H2,25,27,28)/t13-,19+/m1/s1
NCI pathway
Reactome pathway
n/an/a 158n/an/an/an/an/an/a
GlaxoSmithKline
Curated by ChEMBL
Assay Description
Inhibition of ROCK1
J Med Chem 54: 1871-95 (2011)
Article DOI: 10.1021/jm101527u
BindingDB Entry DOI: 10.7270/Q2HQ406Q