BDBM50341365 6-(2,4-Difluorophenoxy)-8-(3-methanesulfonyl-propyl)-2-(tetrahydro-pyran-4-ylamino)-8H-pyrido[2,3-d]pyrimidin-7-one::CHEMBL1766502
SMILES: CS(=O)(=O)CCCn1c2nc(NC3CCOCC3)ncc2cc(Oc2ccc(F)cc2F)c1=O
InChI Key: InChIKey=JJBGSJULKAXNLC-UHFFFAOYSA-N
Data: 1 IC50
Activity Spreadsheet -- Enzyme Inhibition Constant Data from BindingDB
Found 1 hit for monomerid = 50341365
Trg + Lig
Ki
nM
ΔG°
kcal/mole
IC50
nM
Kd
nM
EC50/IC50
nM
koff
s-1
kon
M-1s-1
pHTemp
°C
Mitogen-activated protein kinase 14
(Homo sapiens (Human))
BDBM50341365
(6-(2,4-Difluorophenoxy)-8-(3-methanesulfonyl-propy...)
Show SMILES CS(=O)(=O)CCCn1c2nc(NC3CCOCC3)ncc2cc(Oc2ccc(F)cc2F)c1=O
Show InChI InChI=1S/C22H24F2N4O5S/c1-34(30,31)10-2-7-28-20-14(13-25-22(27-20)26-16-5-8-32-9-6-16)11-19(21(28)29)33-18-4-3-15(23)12-17(18)24/h3-4,11-13,16H,2,5-10H2,1H3,(H,25,26,27)
NCI pathway
Reactome pathway
n/an/a 6n/an/an/an/an/an/a
Roche Palo Alto LLC
Curated by ChEMBL
Assay Description
Inhibition of human recombinant p38alpha assessed as incorporation of 33P from gamma-[33P]ATP into myelin basic protein after 30 mins by scintillatio...
J Med Chem 54: 2255-65 (2011)
Article DOI: 10.1021/jm101423y
BindingDB Entry DOI: 10.7270/Q20P109X