BDBM50342547 2-(3-methylbenzyl)-6,7,8,9-tetrahydro-5H-pyrimido[5,4-d]azepine::CHEMBL1770379
SMILES: Cc1cccc(Cc2ncc3CCNCCc3n2)c1
InChI Key: InChIKey=YJSHACXMERNKPI-UHFFFAOYSA-N
Data: 1 KI  2 EC50
Activity Spreadsheet -- Enzyme Inhibition Constant Data from BindingDB
Found 3 hits for monomerid = 50342547
Trg + Lig
Ki
nM
ΔG°
kcal/mole
IC50
nM
Kd
nM
EC50/IC50
nM
koff
s-1
kon
M-1s-1
pHTemp
°C
5-hydroxytryptamine receptor 2C
(Homo sapiens (Human))
BDBM50342547
(2-(3-methylbenzyl)-6,7,8,9-tetrahydro-5H-pyrimido[...)
Show SMILES Cc1cccc(Cc2ncc3CCNCCc3n2)c1
Show InChI InChI=1S/C16H19N3/c1-12-3-2-4-13(9-12)10-16-18-11-14-5-7-17-8-6-15(14)19-16/h2-4,9,11,17H,5-8,10H2,1H3
Reactome pathway
244n/an/an/an/an/an/an/an/a
Pfizer Inc.
Curated by ChEMBL
Assay Description
Displacement of [3H]meselurgine from human 5HT2C receptor expressed in Swiss mouse 3T3 cells by scintillation proximity assay
Bioorg Med Chem Lett 21: 2715-20 (2011)
Article DOI: 10.1016/j.bmcl.2010.11.120
BindingDB Entry DOI: 10.7270/Q2HD7VZZ
5-hydroxytryptamine receptor 2B
(Homo sapiens (Human))
BDBM50342547
(2-(3-methylbenzyl)-6,7,8,9-tetrahydro-5H-pyrimido[...)
Show SMILES Cc1cccc(Cc2ncc3CCNCCc3n2)c1
Show InChI InChI=1S/C16H19N3/c1-12-3-2-4-13(9-12)10-16-18-11-14-5-7-17-8-6-15(14)19-16/h2-4,9,11,17H,5-8,10H2,1H3
Reactome pathway
n/an/an/an/a 410n/an/an/an/a
Pfizer Inc.
Curated by ChEMBL
Assay Description
Agonist activity at human 5HT2B receptor expressed in CHO-K1 cells assessed as increase of fluorescence based calcium mobilization by FLIPR assay
Bioorg Med Chem Lett 21: 2715-20 (2011)
Article DOI: 10.1016/j.bmcl.2010.11.120
BindingDB Entry DOI: 10.7270/Q2HD7VZZ
5-hydroxytryptamine receptor 2C
(Homo sapiens (Human))
BDBM50342547
(2-(3-methylbenzyl)-6,7,8,9-tetrahydro-5H-pyrimido[...)
Show SMILES Cc1cccc(Cc2ncc3CCNCCc3n2)c1
Show InChI InChI=1S/C16H19N3/c1-12-3-2-4-13(9-12)10-16-18-11-14-5-7-17-8-6-15(14)19-16/h2-4,9,11,17H,5-8,10H2,1H3
Reactome pathway
n/an/an/an/a 210n/an/an/an/a
Pfizer Inc.
Curated by ChEMBL
Assay Description
Agonist activity at human 5HT2C receptor expressed in CHO-K1 cells assessed as increase of fluorescence based calcium mobilization by FLIPR assay
Bioorg Med Chem Lett 21: 2715-20 (2011)
Article DOI: 10.1016/j.bmcl.2010.11.120
BindingDB Entry DOI: 10.7270/Q2HD7VZZ