BDBM50342628 CHEMBL1770718::N-((6S,9R)-6-(2,3-difluorophenyl)-3-(methoxymethyl)-6,7,8,9-tetrahydro-5H-imidazo[1,2-a]azepin-9-yl)-2'-oxo-1',2'-dihydrospiro[piperidine-4,3'-pyrrolo[2,3-b]pyridine]-1-carboxamide
SMILES: COCc1cnc2[C@@H](CC[C@H](Cn12)c1cccc(F)c1F)NC(=O)N1CCC2(CC1)C(=O)Nc1ncccc21
InChI Key: InChIKey=KOWBQWYMVQYTPO-VGOFRKELSA-N
Data: 1 KI  2 IC50
Activity Spreadsheet -- Enzyme Inhibition Constant Data from BindingDB
Found 3 hits for monomerid = 50342628
Trg + Lig
Ki
nM
ΔG°
kcal/mole
IC50
nM
Kd
nM
EC50/IC50
nM
koff
s-1
kon
M-1s-1
pHTemp
°C
Calcitonin gene-related peptide type 1 receptor
(Homo sapiens (Human))
BDBM50342628
(CHEMBL1770718 | N-((6S,9R)-6-(2,3-difluorophenyl)-...)
Show SMILES COCc1cnc2[C@@H](CC[C@H](Cn12)c1cccc(F)c1F)NC(=O)N1CCC2(CC1)C(=O)Nc1ncccc21 |r|
Show InChI InChI=1S/C28H30F2N6O3/c1-39-16-18-14-32-25-22(8-7-17(15-36(18)25)19-4-2-6-21(29)23(19)30)33-27(38)35-12-9-28(10-13-35)20-5-3-11-31-24(20)34-26(28)37/h2-6,11,14,17,22H,7-10,12-13,15-16H2,1H3,(H,33,38)(H,31,34,37)/t17-,22-/m1/s1
0.620n/an/an/an/an/an/an/an/a
Merck Research Laboratories
Curated by ChEMBL
Assay Description
Displacement of [125I]-CGRP from human recombinant CGRP receptor
Bioorg Med Chem Lett 21: 2683-6 (2011)
Article DOI: 10.1016/j.bmcl.2010.12.054
BindingDB Entry DOI: 10.7270/Q2VM4CK8
Calcitonin gene-related peptide type 1 receptor
(Homo sapiens (Human))
BDBM50342628
(CHEMBL1770718 | N-((6S,9R)-6-(2,3-difluorophenyl)-...)
Show SMILES COCc1cnc2[C@@H](CC[C@H](Cn12)c1cccc(F)c1F)NC(=O)N1CCC2(CC1)C(=O)Nc1ncccc21 |r|
Show InChI InChI=1S/C28H30F2N6O3/c1-39-16-18-14-32-25-22(8-7-17(15-36(18)25)19-4-2-6-21(29)23(19)30)33-27(38)35-12-9-28(10-13-35)20-5-3-11-31-24(20)34-26(28)37/h2-6,11,14,17,22H,7-10,12-13,15-16H2,1H3,(H,33,38)(H,31,34,37)/t17-,22-/m1/s1
n/an/a 4.30n/an/an/an/an/an/a
Merck Research Laboratories
Curated by ChEMBL
Assay Description
Antagonist activity at CGRP receptor assessed as inhibition of CGRP-stimulated cAMP production by cell based assay in presence of 50% human serum
Bioorg Med Chem Lett 21: 2683-6 (2011)
Article DOI: 10.1016/j.bmcl.2010.12.054
BindingDB Entry DOI: 10.7270/Q2VM4CK8
Calcitonin gene-related peptide type 1 receptor
(Homo sapiens (Human))
BDBM50342628
(CHEMBL1770718 | N-((6S,9R)-6-(2,3-difluorophenyl)-...)
Show SMILES COCc1cnc2[C@@H](CC[C@H](Cn12)c1cccc(F)c1F)NC(=O)N1CCC2(CC1)C(=O)Nc1ncccc21 |r|
Show InChI InChI=1S/C28H30F2N6O3/c1-39-16-18-14-32-25-22(8-7-17(15-36(18)25)19-4-2-6-21(29)23(19)30)33-27(38)35-12-9-28(10-13-35)20-5-3-11-31-24(20)34-26(28)37/h2-6,11,14,17,22H,7-10,12-13,15-16H2,1H3,(H,33,38)(H,31,34,37)/t17-,22-/m1/s1
n/an/a 1.70n/an/an/an/an/an/a
Merck Research Laboratories
Curated by ChEMBL
Assay Description
Antagonist activity at CGRP receptor assessed as inhibition of CGRP-stimulated cAMP production by cell based assay
Bioorg Med Chem Lett 21: 2683-6 (2011)
Article DOI: 10.1016/j.bmcl.2010.12.054
BindingDB Entry DOI: 10.7270/Q2VM4CK8