BDBM50343215 CHEMBL1615188::N-(6-(2-(methylthio)pyrimidin-4-yl)benzo[d]thiazol-2-yl)acetamide::N-{6-[2-(methylsulfanyl)pyrimidin-4-yl]-1,3-benzothiazol-2-yl}acetamide
SMILES: CSc1nccc(n1)-c1ccc2nc(NC(C)=O)sc2c1
InChI Key: InChIKey=UJBQBHAEDABZIB-UHFFFAOYSA-N
Data: 3 KI  1 IC50
PDB links: 1 PDB ID matches this monomer.
Activity Spreadsheet -- Enzyme Inhibition Constant Data from BindingDB
Found 4 hits for monomerid = 50343215
Trg + Lig
Ki
nM
ΔG°
kcal/mole
IC50
nM
Kd
nM
EC50/IC50
nM
koff
s-1
kon
M-1s-1
pHTemp
°C
Phosphatidylinositol 4,5-bisphosphate 3-kinase catalytic subunit alpha isoform
(Homo sapiens (Human))
BDBM50343215
(CHEMBL1615188 | N-(6-(2-(methylthio)pyrimidin-4-yl...)
Show SMILES CSc1nccc(n1)-c1ccc2nc(NC(C)=O)sc2c1
Show InChI InChI=1S/C14H12N4OS2/c1-8(19)16-14-18-11-4-3-9(7-12(11)21-14)10-5-6-15-13(17-10)20-2/h3-7H,1-2H3,(H,16,18,19)
NCI pathway
Reactome pathway
53n/an/an/an/an/an/an/an/a
Amgen Inc.
Curated by ChEMBL
Assay Description
Inhibition of human PI3Kalpha expressed in Sf9 cells
J Med Chem 54: 1789-811 (2011)
Article DOI: 10.1021/jm1014605
BindingDB Entry DOI: 10.7270/Q2TH8N1K
Phosphatidylinositol 4,5-bisphosphate 3-kinase catalytic subunit alpha isoform
(Homo sapiens (Human))
BDBM50343215
(CHEMBL1615188 | N-(6-(2-(methylthio)pyrimidin-4-yl...)
Show SMILES CSc1nccc(n1)-c1ccc2nc(NC(C)=O)sc2c1
Show InChI InChI=1S/C14H12N4OS2/c1-8(19)16-14-18-11-4-3-9(7-12(11)21-14)10-5-6-15-13(17-10)20-2/h3-7H,1-2H3,(H,16,18,19)
NCI pathway
Reactome pathway
53n/an/an/an/an/an/an/an/a
Amgen Inc.
Curated by ChEMBL
Assay Description
Inhibition of human PI3Kalpha expressed in Sf9 cells
J Med Chem 54: 1789-811 (2011)
Article DOI: 10.1021/jm1014605
BindingDB Entry DOI: 10.7270/Q2TH8N1K
Serine/threonine-protein kinase mTOR
(Homo sapiens (Human))
BDBM50343215
(CHEMBL1615188 | N-(6-(2-(methylthio)pyrimidin-4-yl...)
Show SMILES CSc1nccc(n1)-c1ccc2nc(NC(C)=O)sc2c1
Show InChI InChI=1S/C14H12N4OS2/c1-8(19)16-14-18-11-4-3-9(7-12(11)21-14)10-5-6-15-13(17-10)20-2/h3-7H,1-2H3,(H,16,18,19)
NCI pathway
Reactome pathway
>2.50E+4n/an/an/an/an/an/an/an/a
Amgen Inc.
Curated by ChEMBL
Assay Description
Inhibition of human mTOR
J Med Chem 54: 1789-811 (2011)
Article DOI: 10.1021/jm1014605
BindingDB Entry DOI: 10.7270/Q2TH8N1K
Serine/threonine-protein kinase mTOR
(Homo sapiens (Human))
BDBM50343215
(CHEMBL1615188 | N-(6-(2-(methylthio)pyrimidin-4-yl...)
Show SMILES CSc1nccc(n1)-c1ccc2nc(NC(C)=O)sc2c1
Show InChI InChI=1S/C14H12N4OS2/c1-8(19)16-14-18-11-4-3-9(7-12(11)21-14)10-5-6-15-13(17-10)20-2/h3-7H,1-2H3,(H,16,18,19)
NCI pathway
Reactome pathway
n/an/a>6.00E+3n/an/an/an/an/an/a
Amgen Inc.
Curated by ChEMBL
Assay Description
Inhibition of mTOR assessed as inhibition of 4EBP1 phosphorylation by TR-FRET assay
J Med Chem 54: 1789-811 (2011)
Article DOI: 10.1021/jm1014605
BindingDB Entry DOI: 10.7270/Q2TH8N1K