BDBM50344446 CHEMBL1699130::dimethyl-4,4'-(ethane-1,2-diylbis(benzylazanediyl))bis(4-oxobutanoate)
SMILES: COC(=O)CCC(=O)N(CCN(Cc1ccccc1)C(=O)CCC(=O)OC)Cc1ccccc1
InChI Key: InChIKey=JSFZAZDZIONDON-UHFFFAOYSA-N
Data: 1 KI  1 IC50
Activity Spreadsheet -- Enzyme Inhibition Constant Data from BindingDB
Found 2 hits for monomerid = 50344446
Trg + Lig
Ki
nM
ΔG°
kcal/mole
IC50
nM
Kd
nM
EC50/IC50
nM
koff
s-1
kon
M-1s-1
pHTemp
°C
Plasmepsin 2
(Plasmodium falciparum)
BDBM50344446
(CHEMBL1699130 | dimethyl-4,4'-(ethane-1,2-diylbis(...)
Show SMILES COC(=O)CCC(=O)N(CCN(Cc1ccccc1)C(=O)CCC(=O)OC)Cc1ccccc1
Show InChI InChI=1S/C26H32N2O6/c1-33-25(31)15-13-23(29)27(19-21-9-5-3-6-10-21)17-18-28(20-22-11-7-4-8-12-22)24(30)14-16-26(32)34-2/h3-12H,13-20H2,1-2H3
7.00E+3n/an/an/an/an/an/an/an/a
Trinity College
Curated by ChEMBL
Assay Description
Inhibition of Plasmodium falciparum plasmepsin 2 using DABCYL-Glu-Arg-Nle-Phe-Leu- Ser-Phe-Pro-EDANS fluorogenic substrate by fluorogenic assay
Bioorg Med Chem Lett 21: 3335-41 (2011)
Article DOI: 10.1016/j.bmcl.2011.04.015
BindingDB Entry DOI: 10.7270/Q24J0FFK
Plasmepsin 2
(Plasmodium falciparum)
BDBM50344446
(CHEMBL1699130 | dimethyl-4,4'-(ethane-1,2-diylbis(...)
Show SMILES COC(=O)CCC(=O)N(CCN(Cc1ccccc1)C(=O)CCC(=O)OC)Cc1ccccc1
Show InChI InChI=1S/C26H32N2O6/c1-33-25(31)15-13-23(29)27(19-21-9-5-3-6-10-21)17-18-28(20-22-11-7-4-8-12-22)24(30)14-16-26(32)34-2/h3-12H,13-20H2,1-2H3
n/an/a 1.00E+4n/an/an/an/an/an/a
Trinity College
Curated by ChEMBL
Assay Description
Inhibition of Plasmodium falciparum plasmepsin 2 using DABCYL-Glu-Arg-Nle-Phe-Leu- Ser-Phe-Pro-EDANS fluorogenic substrate by fluorogenic assay
Bioorg Med Chem Lett 21: 3335-41 (2011)
Article DOI: 10.1016/j.bmcl.2011.04.015
BindingDB Entry DOI: 10.7270/Q24J0FFK