BDBM50344802 5-(2,5-dichlorophenyl)-N-(3,5-dimethylbiphenyl-4-yl)furan-2-carboxamide::CHEMBL1779904
SMILES: Cc1cc(cc(C)c1NC(=O)c1ccc(o1)-c1cc(Cl)ccc1Cl)-c1ccccc1
InChI Key: InChIKey=XQVISYQCTFYGMZ-UHFFFAOYSA-N
Data: 1 IC50
Activity Spreadsheet -- Enzyme Inhibition Constant Data from BindingDB
Found 1 hit for monomerid = 50344802
Trg + Lig
Ki
nM
ΔG°
kcal/mole
IC50
nM
Kd
nM
EC50/IC50
nM
koff
s-1
kon
M-1s-1
pHTemp
°C
Sphingosine 1-phosphate receptor 4
(Homo sapiens (Human))
BDBM50344802
(5-(2,5-dichlorophenyl)-N-(3,5-dimethylbiphenyl-4-y...)
Show SMILES Cc1cc(cc(C)c1NC(=O)c1ccc(o1)-c1cc(Cl)ccc1Cl)-c1ccccc1
Show InChI InChI=1S/C25H19Cl2NO2/c1-15-12-18(17-6-4-3-5-7-17)13-16(2)24(15)28-25(29)23-11-10-22(30-23)20-14-19(26)8-9-21(20)27/h3-14H,1-2H3,(H,28,29)
NCI pathway
Reactome pathway
n/an/a 115n/an/an/an/an/an/a
The Scripps Research Institute
Curated by ChEMBL
Assay Description
Antagonist activity at S1P4 receptor in human U2OS cells expressing EDG6-linked GAL4-VP16 transcription factor via TEV protease site/beta-arrestin/TE...
Bioorg Med Chem Lett 21: 3632-6 (2011)
Article DOI: 10.1016/j.bmcl.2011.04.097
BindingDB Entry DOI: 10.7270/Q2T1540Z