BDBM50345056 2-(6-(3-((dimethylamino)methyl)phenyl)-2-(4-fluoro-3-methoxyphenyl)-4-oxoquinazolin-3(4H)-yl)-N-isopropylacetamide::CHEMBL1778961
SMILES: COc1cc(ccc1F)-c1nc2ccc(cc2c(=O)n1CC(=O)NC(C)C)-c1cccc(CN(C)C)c1
InChI Key: InChIKey=WRZIZHSMSVOESG-UHFFFAOYSA-N
Data: 1 IC50
Activity Spreadsheet -- Enzyme Inhibition Constant Data from BindingDB
Found 1 hit for monomerid = 50345056
Trg + Lig
Ki
nM
ΔG°
kcal/mole
IC50
nM
Kd
nM
EC50/IC50
nM
koff
s-1
kon
M-1s-1
pHTemp
°C
Vasopressin V1b receptor
(Homo sapiens (Human))
BDBM50345056
(2-(6-(3-((dimethylamino)methyl)phenyl)-2-(4-fluoro...)
Show SMILES COc1cc(ccc1F)-c1nc2ccc(cc2c(=O)n1CC(=O)NC(C)C)-c1cccc(CN(C)C)c1
Show InChI InChI=1S/C29H31FN4O3/c1-18(2)31-27(35)17-34-28(22-9-11-24(30)26(15-22)37-5)32-25-12-10-21(14-23(25)29(34)36)20-8-6-7-19(13-20)16-33(3)4/h6-15,18H,16-17H2,1-5H3,(H,31,35)
n/an/a 1n/an/an/an/an/an/a
MSD
Curated by ChEMBL
Assay Description
Displacement of [3H]AVP from human vasopressin V1b receptor expressed in CHO cells co-expressing VIP-luciferase by scintillation counting-based whole...
Bioorg Med Chem Lett 21: 3813-7 (2011)
Article DOI: 10.1016/j.bmcl.2011.04.022
BindingDB Entry DOI: 10.7270/Q2CV4J34