BDBM50346920 CHEMBL1795686
SMILES: CCc1c(OCc2ccc(F)cc2F)ncn(-c2cc(ccc2C)C(=O)NCCO)c1=O
InChI Key: InChIKey=TZPMPKKHGISYQB-UHFFFAOYSA-N
Data: 1 KI  2 IC50
Activity Spreadsheet -- Enzyme Inhibition Constant Data from BindingDB
Found 3 hits for monomerid = 50346920
Trg + Lig
Ki
nM
ΔG°
kcal/mole
IC50
nM
Kd
nM
EC50/IC50
nM
koff
s-1
kon
M-1s-1
pHTemp
°C
Mitogen-activated protein kinase 11
(Homo sapiens (Human))
BDBM50346920
(CHEMBL1795686)
Show SMILES CCc1c(OCc2ccc(F)cc2F)ncn(-c2cc(ccc2C)C(=O)NCCO)c1=O
Show InChI InChI=1S/C23H23F2N3O4/c1-3-18-22(32-12-16-6-7-17(24)11-19(16)25)27-13-28(23(18)31)20-10-15(5-4-14(20)2)21(30)26-8-9-29/h4-7,10-11,13,29H,3,8-9,12H2,1-2H3,(H,26,30)
Reactome pathway
6n/an/an/an/an/an/an/an/a
Pfizer Inc.
Curated by ChEMBL
Assay Description
Inhibition of p38beta kinase
Bioorg Med Chem Lett 21: 3856-60 (2011)
Article DOI: 10.1016/j.bmcl.2011.05.006
BindingDB Entry DOI: 10.7270/Q2G73F2S
Mitogen-activated protein kinase 14
(Homo sapiens (Human))
BDBM50346920
(CHEMBL1795686)
Show SMILES CCc1c(OCc2ccc(F)cc2F)ncn(-c2cc(ccc2C)C(=O)NCCO)c1=O
Show InChI InChI=1S/C23H23F2N3O4/c1-3-18-22(32-12-16-6-7-17(24)11-19(16)25)27-13-28(23(18)31)20-10-15(5-4-14(20)2)21(30)26-8-9-29/h4-7,10-11,13,29H,3,8-9,12H2,1-2H3,(H,26,30)
NCI pathway
Reactome pathway
n/an/a 11n/an/an/an/an/an/a
Pfizer Inc.
Curated by ChEMBL
Assay Description
Inhibition of p38alpha kinase-dependent HSP-27 phosphorylation in human U937 cells
Bioorg Med Chem Lett 21: 3856-60 (2011)
Article DOI: 10.1016/j.bmcl.2011.05.006
BindingDB Entry DOI: 10.7270/Q2G73F2S
Mitogen-activated protein kinase 9
(Homo sapiens (Human))
BDBM50346920
(CHEMBL1795686)
Show SMILES CCc1c(OCc2ccc(F)cc2F)ncn(-c2cc(ccc2C)C(=O)NCCO)c1=O
Show InChI InChI=1S/C23H23F2N3O4/c1-3-18-22(32-12-16-6-7-17(24)11-19(16)25)27-13-28(23(18)31)20-10-15(5-4-14(20)2)21(30)26-8-9-29/h4-7,10-11,13,29H,3,8-9,12H2,1-2H3,(H,26,30)
NCI pathway
Reactome pathway
n/an/a>2.00E+5n/an/an/an/an/an/a
Pfizer Inc.
Curated by ChEMBL
Assay Description
Inhibition of JNK2
Bioorg Med Chem Lett 21: 3856-60 (2011)
Article DOI: 10.1016/j.bmcl.2011.05.006
BindingDB Entry DOI: 10.7270/Q2G73F2S