BDBM50347468 CHEMBL1802203
SMILES: COc1cc(Br)cc2nc3ccccc3nc12
InChI Key: InChIKey=NBYICNJIRHYVFV-UHFFFAOYSA-N
Data: 1 IC50
Activity Spreadsheet -- Enzyme Inhibition Constant Data from BindingDB
Found 1 hit for monomerid = 50347468
Trg + Lig
Ki
nM
ΔG°
kcal/mole
IC50
nM
Kd
nM
EC50/IC50
nM
koff
s-1
kon
M-1s-1
pHTemp
°C
Ribosyldihydronicotinamide dehydrogenase [quinone]
(Homo sapiens (Human))
BDBM50347468
(CHEMBL1802203)
Show SMILES COc1cc(Br)cc2nc3ccccc3nc12
Show InChI InChI=1S/C13H9BrN2O/c1-17-12-7-8(14)6-11-13(12)16-10-5-3-2-4-9(10)15-11/h2-7H,1H3
n/an/a 690n/an/an/an/an/an/a
Purdue University
Curated by ChEMBL
Assay Description
Inhibition of human QR2 expressed in Escherichia coli BL21 (DE3) using MTT and NMeH as substrate assessed as formazan formation
J Med Chem 53: 8688-99 (2010)
Article DOI: 10.1021/jm1011066
BindingDB Entry DOI: 10.7270/Q2TB178C