BDBM50348392 CHEMBL1800245
SMILES: CC(=O)Nc1ccc(cc1)C(=O)CSc1cccc(O)c1
InChI Key: InChIKey=ZKJBOQRBWXMBRK-UHFFFAOYSA-N
Data: 9 IC50
Activity Spreadsheet -- Enzyme Inhibition Constant Data from BindingDB
Found 9 hits for monomerid = 50348392
Trg + Lig
Ki
nM
ΔG°
kcal/mole
IC50
nM
Kd
nM
EC50/IC50
nM
koff
s-1
kon
M-1s-1
pHTemp
°C
Histone deacetylase 5
(Homo sapiens (Human))
BDBM50348392
(CHEMBL1800245)
Show SMILES CC(=O)Nc1ccc(cc1)C(=O)CSc1cccc(O)c1
Show InChI InChI=1S/C16H15NO3S/c1-11(18)17-13-7-5-12(6-8-13)16(20)10-21-15-4-2-3-14(19)9-15/h2-9,19H,10H2,1H3,(H,17,18)
n/an/a>1.00E+5n/an/an/an/an/an/a
Broad Institute of Harvard and MIT
Curated by ChEMBL
Assay Description
Inhibition of recombinant HDAC5 assessed as inhibition of fluorogenic aminocoumarin release from substrate by trypsin-coupled biochemical assay
Bioorg Med Chem Lett 21: 4164-9 (2011)
Article DOI: 10.1016/j.bmcl.2011.05.098
BindingDB Entry DOI: 10.7270/Q20P10CT
Cereblon/Histone deacetylase 6
(Homo sapiens (Human))
BDBM50348392
(CHEMBL1800245)
Show SMILES CC(=O)Nc1ccc(cc1)C(=O)CSc1cccc(O)c1
Show InChI InChI=1S/C16H15NO3S/c1-11(18)17-13-7-5-12(6-8-13)16(20)10-21-15-4-2-3-14(19)9-15/h2-9,19H,10H2,1H3,(H,17,18)
NCI pathway
Reactome pathway
n/an/a>1.00E+5n/an/an/an/an/an/a
Broad Institute of Harvard and MIT
Curated by ChEMBL
Assay Description
Inhibition of recombinant HDAC6 assessed as inhibition of fluorogenic aminocoumarin release from substrate by trypsin-coupled biochemical assay
Bioorg Med Chem Lett 21: 4164-9 (2011)
Article DOI: 10.1016/j.bmcl.2011.05.098
BindingDB Entry DOI: 10.7270/Q20P10CT
Histone deacetylase 7
(Homo sapiens (Human))
BDBM50348392
(CHEMBL1800245)
Show SMILES CC(=O)Nc1ccc(cc1)C(=O)CSc1cccc(O)c1
Show InChI InChI=1S/C16H15NO3S/c1-11(18)17-13-7-5-12(6-8-13)16(20)10-21-15-4-2-3-14(19)9-15/h2-9,19H,10H2,1H3,(H,17,18)
NCI pathway
Reactome pathway
n/an/a>1.00E+5n/an/an/an/an/an/a
Broad Institute of Harvard and MIT
Curated by ChEMBL
Assay Description
Inhibition of recombinant HDAC7 assessed as inhibition of fluorogenic aminocoumarin release from substrate by trypsin-coupled biochemical assay
Bioorg Med Chem Lett 21: 4164-9 (2011)
Article DOI: 10.1016/j.bmcl.2011.05.098
BindingDB Entry DOI: 10.7270/Q20P10CT
Histone deacetylase 8
(Homo sapiens (Human))
BDBM50348392
(CHEMBL1800245)
Show SMILES CC(=O)Nc1ccc(cc1)C(=O)CSc1cccc(O)c1
Show InChI InChI=1S/C16H15NO3S/c1-11(18)17-13-7-5-12(6-8-13)16(20)10-21-15-4-2-3-14(19)9-15/h2-9,19H,10H2,1H3,(H,17,18)
NCI pathway
Reactome pathway
n/an/a>1.00E+5n/an/an/an/an/an/a
Broad Institute of Harvard and MIT
Curated by ChEMBL
Assay Description
Inhibition of recombinant HDAC8 assessed as inhibition of fluorogenic aminocoumarin release from substrate by trypsin-coupled biochemical assay
Bioorg Med Chem Lett 21: 4164-9 (2011)
Article DOI: 10.1016/j.bmcl.2011.05.098
BindingDB Entry DOI: 10.7270/Q20P10CT
Histone deacetylase 4
(Homo sapiens (Human))
BDBM50348392
(CHEMBL1800245)
Show SMILES CC(=O)Nc1ccc(cc1)C(=O)CSc1cccc(O)c1
Show InChI InChI=1S/C16H15NO3S/c1-11(18)17-13-7-5-12(6-8-13)16(20)10-21-15-4-2-3-14(19)9-15/h2-9,19H,10H2,1H3,(H,17,18)
n/an/a>1.00E+5n/an/an/an/an/an/a
Broad Institute of Harvard and MIT
Curated by ChEMBL
Assay Description
Inhibition of recombinant HDAC4 assessed as inhibition of fluorogenic aminocoumarin release from substrate by trypsin-coupled biochemical assay
Bioorg Med Chem Lett 21: 4164-9 (2011)
Article DOI: 10.1016/j.bmcl.2011.05.098
BindingDB Entry DOI: 10.7270/Q20P10CT
Histone deacetylase 1
(Homo sapiens (Human))
BDBM50348392
(CHEMBL1800245)
Show SMILES CC(=O)Nc1ccc(cc1)C(=O)CSc1cccc(O)c1
Show InChI InChI=1S/C16H15NO3S/c1-11(18)17-13-7-5-12(6-8-13)16(20)10-21-15-4-2-3-14(19)9-15/h2-9,19H,10H2,1H3,(H,17,18)
NCI pathway
Reactome pathway
n/an/a>1.00E+5n/an/an/an/an/an/a
Broad Institute of Harvard and MIT
Curated by ChEMBL
Assay Description
Inhibition of recombinant HDAC1 assessed as inhibition of fluorogenic aminocoumarin release from substrate by trypsin-coupled biochemical assay
Bioorg Med Chem Lett 21: 4164-9 (2011)
Article DOI: 10.1016/j.bmcl.2011.05.098
BindingDB Entry DOI: 10.7270/Q20P10CT
Histone deacetylase 2
(Homo sapiens (Human))
BDBM50348392
(CHEMBL1800245)
Show SMILES CC(=O)Nc1ccc(cc1)C(=O)CSc1cccc(O)c1
Show InChI InChI=1S/C16H15NO3S/c1-11(18)17-13-7-5-12(6-8-13)16(20)10-21-15-4-2-3-14(19)9-15/h2-9,19H,10H2,1H3,(H,17,18)
NCI pathway
Reactome pathway
n/an/a>1.00E+5n/an/an/an/an/an/a
Broad Institute of Harvard and MIT
Curated by ChEMBL
Assay Description
Inhibition of recombinant HDAC2 assessed as inhibition of fluorogenic aminocoumarin release from substrate by trypsin-coupled biochemical assay
Bioorg Med Chem Lett 21: 4164-9 (2011)
Article DOI: 10.1016/j.bmcl.2011.05.098
BindingDB Entry DOI: 10.7270/Q20P10CT
Histone deacetylase 3
(Homo sapiens (Human))
BDBM50348392
(CHEMBL1800245)
Show SMILES CC(=O)Nc1ccc(cc1)C(=O)CSc1cccc(O)c1
Show InChI InChI=1S/C16H15NO3S/c1-11(18)17-13-7-5-12(6-8-13)16(20)10-21-15-4-2-3-14(19)9-15/h2-9,19H,10H2,1H3,(H,17,18)
NCI pathway
Reactome pathway
n/an/a>1.00E+5n/an/an/an/an/an/a
Broad Institute of Harvard and MIT
Curated by ChEMBL
Assay Description
Inhibition of recombinant HDAC3 assessed as inhibition of fluorogenic aminocoumarin release from substrate by trypsin-coupled biochemical assay
Bioorg Med Chem Lett 21: 4164-9 (2011)
Article DOI: 10.1016/j.bmcl.2011.05.098
BindingDB Entry DOI: 10.7270/Q20P10CT
Histone deacetylase 9
(Homo sapiens (Human))
BDBM50348392
(CHEMBL1800245)
Show SMILES CC(=O)Nc1ccc(cc1)C(=O)CSc1cccc(O)c1
Show InChI InChI=1S/C16H15NO3S/c1-11(18)17-13-7-5-12(6-8-13)16(20)10-21-15-4-2-3-14(19)9-15/h2-9,19H,10H2,1H3,(H,17,18)
Reactome pathway
n/an/a>1.00E+5n/an/an/an/an/an/a
Broad Institute of Harvard and MIT
Curated by ChEMBL
Assay Description
Inhibition of recombinant HDAC9 assessed as inhibition of fluorogenic aminocoumarin release from substrate by trypsin-coupled biochemical assay
Bioorg Med Chem Lett 21: 4164-9 (2011)
Article DOI: 10.1016/j.bmcl.2011.05.098
BindingDB Entry DOI: 10.7270/Q20P10CT