BDBM50348504 CHEMBL1801281
SMILES: Fc1cccc(c1)-c1cc2-c3[nH]c4c(c3CCc2cn1)C(=O)NCC41CC1
InChI Key: InChIKey=OSHCYABVVJIJAJ-UHFFFAOYSA-N
Data: 2 IC50
Activity Spreadsheet -- Enzyme Inhibition Constant Data from BindingDB
Found 2 hits for monomerid = 50348504
Trg + Lig
Ki
nM
ΔG°
kcal/mole
IC50
nM
Kd
nM
EC50/IC50
nM
koff
s-1
kon
M-1s-1
pHTemp
°C
MAP kinase-activated protein kinase 2
(Homo sapiens (Human))
BDBM50348504
(CHEMBL1801281)
Show SMILES Fc1cccc(c1)-c1cc2-c3[nH]c4c(c3CCc2cn1)C(=O)NCC41CC1
Show InChI InChI=1S/C22H18FN3O/c23-14-3-1-2-12(8-14)17-9-16-13(10-24-17)4-5-15-18-20(26-19(15)16)22(6-7-22)11-25-21(18)27/h1-3,8-10,26H,4-7,11H2,(H,25,27)
NCI pathway
Reactome pathway
n/an/a 900n/an/an/an/an/an/a
Novartis Institutes for BioMedical Research
Curated by ChEMBL
Assay Description
Inhibition of MK2 mediated anisomycin-stimulated hsp27 phosphorylation in human THP-1 cells by fluorometric analysis
Bioorg Med Chem Lett 20: 4719-23 (2010)
Checked by Author
Article DOI: 10.1016/j.bmcl.2010.04.023
BindingDB Entry DOI: 10.7270/Q2BZ66C2
MAP kinase-activated protein kinase 2
(Homo sapiens (Human))
BDBM50348504
(CHEMBL1801281)
Show SMILES Fc1cccc(c1)-c1cc2-c3[nH]c4c(c3CCc2cn1)C(=O)NCC41CC1
Show InChI InChI=1S/C22H18FN3O/c23-14-3-1-2-12(8-14)17-9-16-13(10-24-17)4-5-15-18-20(26-19(15)16)22(6-7-22)11-25-21(18)27/h1-3,8-10,26H,4-7,11H2,(H,25,27)
NCI pathway
Reactome pathway
n/an/a 100n/an/an/an/an/an/a
Novartis Institutes for BioMedical Research
Curated by ChEMBL
Assay Description
Inhibition of human MK2 using biotinyl-AYSRALSRQLSSGVSEIRCOOH as substrate after 45 mins by FRET analysis
Bioorg Med Chem Lett 20: 4719-23 (2010)
Checked by Author
Article DOI: 10.1016/j.bmcl.2010.04.023
BindingDB Entry DOI: 10.7270/Q2BZ66C2