BDBM50349004 CHEMBL1807469
SMILES: CN1CCN(CC1)c1ccc(cc1)C(=O)Nc1cc(n[nH]1)-c1cccc(NS(=O)(=O)c2cccc(C)c2)c1
InChI Key: InChIKey=JWZRVKDTKFYYDV-UHFFFAOYSA-N
Data: 4 IC50
Activity Spreadsheet -- Enzyme Inhibition Constant Data from BindingDB
Found 4 hits for monomerid = 50349004
Trg + Lig
Ki
nM
ΔG°
kcal/mole
IC50
nM
Kd
nM
EC50/IC50
nM
koff
s-1
kon
M-1s-1
pHTemp
°C
Vascular endothelial growth factor receptor 1
(Homo sapiens (Human))
BDBM50349004
(CHEMBL1807469)
Show SMILES CN1CCN(CC1)c1ccc(cc1)C(=O)Nc1cc(n[nH]1)-c1cccc(NS(=O)(=O)c2cccc(C)c2)c1
Show InChI InChI=1S/C28H30N6O3S/c1-20-5-3-8-25(17-20)38(36,37)32-23-7-4-6-22(18-23)26-19-27(31-30-26)29-28(35)21-9-11-24(12-10-21)34-15-13-33(2)14-16-34/h3-12,17-19,32H,13-16H2,1-2H3,(H2,29,30,31,35)
n/an/a 140n/an/an/an/an/an/a
National Health Research Institutes
Curated by ChEMBL
Assay Description
Inhibition of recombinant GST-tagged VEGFR1 expressed in Sf9 insect cells after 120 mins by Kinase-Glo assay
Bioorg Med Chem 19: 4173-82 (2011)
Article DOI: 10.1016/j.bmc.2011.06.016
BindingDB Entry DOI: 10.7270/Q2CR5TQV
Receptor-type tyrosine-protein kinase FLT3
(Homo sapiens (Human))
BDBM50349004
(CHEMBL1807469)
Show SMILES CN1CCN(CC1)c1ccc(cc1)C(=O)Nc1cc(n[nH]1)-c1cccc(NS(=O)(=O)c2cccc(C)c2)c1
Show InChI InChI=1S/C28H30N6O3S/c1-20-5-3-8-25(17-20)38(36,37)32-23-7-4-6-22(18-23)26-19-27(31-30-26)29-28(35)21-9-11-24(12-10-21)34-15-13-33(2)14-16-34/h3-12,17-19,32H,13-16H2,1-2H3,(H2,29,30,31,35)
n/an/a 7n/an/an/an/an/an/a
National Health Research Institutes
Curated by ChEMBL
Assay Description
Inhibition of GST-tagged FLT3 expressing wild type kinase domain expressed in Sf9 insect cells after 4 hrs by Kinase-Glo assay
Bioorg Med Chem 19: 4173-82 (2011)
Article DOI: 10.1016/j.bmc.2011.06.016
BindingDB Entry DOI: 10.7270/Q2CR5TQV
Aurora kinase A
(Homo sapiens (Human))
BDBM50349004
(CHEMBL1807469)
Show SMILES CN1CCN(CC1)c1ccc(cc1)C(=O)Nc1cc(n[nH]1)-c1cccc(NS(=O)(=O)c2cccc(C)c2)c1
Show InChI InChI=1S/C28H30N6O3S/c1-20-5-3-8-25(17-20)38(36,37)32-23-7-4-6-22(18-23)26-19-27(31-30-26)29-28(35)21-9-11-24(12-10-21)34-15-13-33(2)14-16-34/h3-12,17-19,32H,13-16H2,1-2H3,(H2,29,30,31,35)
NCI pathway
Reactome pathway
n/an/a 430n/an/an/an/an/an/a
National Health Research Institutes
Curated by ChEMBL
Assay Description
Inhibition of recombinant GST-tagged Aurora A expressed in Sf9 insect cells after 90 mins by Kinase-Glo assay
Bioorg Med Chem 19: 4173-82 (2011)
Article DOI: 10.1016/j.bmc.2011.06.016
BindingDB Entry DOI: 10.7270/Q2CR5TQV
Vascular endothelial growth factor receptor 2
(Homo sapiens (Human))
BDBM50349004
(CHEMBL1807469)
Show SMILES CN1CCN(CC1)c1ccc(cc1)C(=O)Nc1cc(n[nH]1)-c1cccc(NS(=O)(=O)c2cccc(C)c2)c1
Show InChI InChI=1S/C28H30N6O3S/c1-20-5-3-8-25(17-20)38(36,37)32-23-7-4-6-22(18-23)26-19-27(31-30-26)29-28(35)21-9-11-24(12-10-21)34-15-13-33(2)14-16-34/h3-12,17-19,32H,13-16H2,1-2H3,(H2,29,30,31,35)
NCI pathway
Reactome pathway
n/an/a 70n/an/an/an/an/an/a
National Health Research Institutes
Curated by ChEMBL
Assay Description
Inhibition of recombinant GST-tagged VEGFR2 expressed in Sf9 insect cells after 120 mins by Kinase-Glo assay
Bioorg Med Chem 19: 4173-82 (2011)
Article DOI: 10.1016/j.bmc.2011.06.016
BindingDB Entry DOI: 10.7270/Q2CR5TQV