null
SMILES: CS(=O)(=O)N(CCN)c1ccc(Nc2ncc3cnn(C4CCCCCC4)c3n2)cc1
InChI Key: InChIKey=BCBUOCNTMGMTQK-UHFFFAOYSA-N
Activity Spreadsheet -- Enzyme Inhibition Constant Data from BindingDB
Found 2 hits for monomerid = 50352215
Trg + Lig
Ki
nM
ΔG°
kcal/mole
IC50
nM
Kd
nM
EC50/IC50
nM
koff
s-1
kon
M-1s-1
pHTemp
°C
Cyclin-dependent kinase/G2/mitotic-specific cyclin- 1
(Homo sapiens (Human))
BDBM50352215
(CHEMBL1825093)
Show SMILES CS(=O)(=O)N(CCN)c1ccc(Nc2ncc3cnn(C4CCCCCC4)c3n2)cc1
Show InChI InChI=1S/C21H29N7O2S/c1-31(29,30)27(13-12-22)18-10-8-17(9-11-18)25-21-23-14-16-15-24-28(20(16)26-21)19-6-4-2-3-5-7-19/h8-11,14-15,19H,2-7,12-13,22H2,1H3,(H,23,25,26)
Reactome pathway
n/an/a 5n/an/an/an/an/an/a
Biogen Idec Inc.
Curated by ChEMBL
Assay Description
Inhibition of CDK1/Cyclin B assessed as phosphorylation of Z-lyte Peptide at 0.017 to 30 nM by FRET assay
Bioorg Med Chem Lett 21: 5633-7 (2011)
Article DOI: 10.1016/j.bmcl.2011.06.129
BindingDB Entry DOI: 10.7270/Q2HM58VW
Aurora kinase A
(Homo sapiens (Human))
BDBM50352215
(CHEMBL1825093)
Show SMILES CS(=O)(=O)N(CCN)c1ccc(Nc2ncc3cnn(C4CCCCCC4)c3n2)cc1
Show InChI InChI=1S/C21H29N7O2S/c1-31(29,30)27(13-12-22)18-10-8-17(9-11-18)25-21-23-14-16-15-24-28(20(16)26-21)19-6-4-2-3-5-7-19/h8-11,14-15,19H,2-7,12-13,22H2,1H3,(H,23,25,26)
NCI pathway
Reactome pathway
n/an/a 20n/an/an/an/an/an/a
Biogen Idec Inc.
Curated by ChEMBL
Assay Description
Inhibition of Aurora kinase A assessed as phosphorylation of Lats2 substrate at 0.017 to 30 nM by FRET assay
Bioorg Med Chem Lett 21: 5633-7 (2011)
Article DOI: 10.1016/j.bmcl.2011.06.129
BindingDB Entry DOI: 10.7270/Q2HM58VW