BDBM50354829 CHEMBL1834093
SMILES: Cc1cc(nc(N)n1)-c1ccc2COCc3cccc1c23
InChI Key: InChIKey=RUGFWNOTXBMCJB-UHFFFAOYSA-N
Data: 1 IC50  1 Kd
PDB links: 1 PDB ID matches this monomer.
Activity Spreadsheet -- Enzyme Inhibition Constant Data from BindingDB
Found 2 hits for monomerid = 50354829
Trg + Lig
Ki
nM
ΔG°
kcal/mole
IC50
nM
Kd
nM
EC50/IC50
nM
koff
s-1
kon
M-1s-1
pHTemp
°C
Heat shock protein HSP 90-alpha
(Homo sapiens (Human))
BDBM50354829
(CHEMBL1834093)
Show SMILES Cc1cc(nc(N)n1)-c1ccc2COCc3cccc1c23
Show InChI InChI=1S/C17H15N3O/c1-10-7-15(20-17(18)19-10)13-6-5-12-9-21-8-11-3-2-4-14(13)16(11)12/h2-7H,8-9H2,1H3,(H2,18,19,20)
NCI pathway
Reactome pathway
n/an/a 6.90E+3n/an/an/an/an/an/a
Chugai Pharmaceutical Co., Ltd
Curated by ChEMBL
Assay Description
Inhibition of human N-terminal GST-tagged HSP90alpha expressed in Escherichia coli after 1 hr using 10 mM of ATP and malachite green by microplate re...
Bioorg Med Chem Lett 21: 5778-83 (2011)
Checked by Author
Article DOI: 10.1016/j.bmcl.2011.08.001
BindingDB Entry DOI: 10.7270/Q2QJ7HQX
3D
3D Structure (crystal)
Heat shock protein HSP 90-alpha
(Homo sapiens (Human))
BDBM50354829
(CHEMBL1834093)
Show SMILES Cc1cc(nc(N)n1)-c1ccc2COCc3cccc1c23
Show InChI InChI=1S/C17H15N3O/c1-10-7-15(20-17(18)19-10)13-6-5-12-9-21-8-11-3-2-4-14(13)16(11)12/h2-7H,8-9H2,1H3,(H2,18,19,20)
NCI pathway
Reactome pathway
n/an/an/a 230n/an/an/an/an/a
Chugai Pharmaceutical Co., Ltd
Curated by ChEMBL
Assay Description
Binding affinity to human HSP90alpha assessed as 2D1H-15N chemical shift perturbation by NMR spectroscopy
Bioorg Med Chem Lett 21: 5778-83 (2011)
Checked by Author
Article DOI: 10.1016/j.bmcl.2011.08.001
BindingDB Entry DOI: 10.7270/Q2QJ7HQX
3D
3D Structure (crystal)