BDBM50355785 CHEMBL1911624
SMILES: CCCCN(C)C(=O)Cn1c2nn(-c3ccc(F)cc3)c(=O)c2c(C)c2ccccc12
InChI Key: InChIKey=XMSNXDPXGVQOSR-UHFFFAOYSA-N
Data: 1 IC50
Activity Spreadsheet -- Enzyme Inhibition Constant Data from BindingDB
Found 1 hit for monomerid = 50355785
Trg + Lig
Ki
nM
ΔG°
kcal/mole
IC50
nM
Kd
nM
EC50/IC50
nM
koff
s-1
kon
M-1s-1
pHTemp
°C
Peripheral-Type Benzodiazepine Receptor
(Rattus norvegicus (rat))
BDBM50355785
(CHEMBL1911624)
Show SMILES CCCCN(C)C(=O)Cn1c2nn(-c3ccc(F)cc3)c(=O)c2c(C)c2ccccc12
Show InChI InChI=1S/C24H25FN4O2/c1-4-5-14-27(3)21(30)15-28-20-9-7-6-8-19(20)16(2)22-23(28)26-29(24(22)31)18-12-10-17(25)11-13-18/h6-13H,4-5,14-15H2,1-3H3
n/an/a 0.130n/an/an/an/an/an/a
Universit£ degli Studi di Siena
Curated by ChEMBL
Assay Description
Displacement of [3H]PK11195 from TSPO in Sprague-Dawley rat brain homogenates after 90 mins by liquid scintillation spectrometry
J Med Chem 54: 7165-75 (2011)
Article DOI: 10.1021/jm200770f
BindingDB Entry DOI: 10.7270/Q2MG7PWM